axis-c-dev mailing list archives

Site index · List index
Message view « Date » · « Thread »
Top « Date » · « Thread »
From Fred Preston <PREST...@uk.ibm.com>
Subject Re: [test-results]Axis C++ Autobuild and regression test
Date Thu, 16 Sep 2004 08:30:12 GMT




Hi Damitha,
      For your information, AxisBench fails because of a problem in xerces
(see defect XERCESC-1271 in Jira).  I have fixed the problem locally on my
machine, but can't fix the problem globally because I do not have access to
the project.

Regards,

Fred Preston.
Software Engineer
CWSS



                                                                                         
                                             
                      damitha kumarage                                                   
                                             
                      <damitha@opensour        To:       axis-c-dev@ws.apache.org     
                                                
                      ce.lk>                   cc:                                    
                                                
                                               Subject:  [test-results]Axis C++ Autobuild
and regression test                          
                      16/09/04 08:30                                                     
                                             
                      Please respond to                                                  
                                             
                      "Apache AXIS C                                                     
                                             
                      Developers List"                                                   
                                             
                                                                                         
                                             
                                                                                         
                                             




16/09/2004 13:06:13: Regression test on AxisBench.cpp: RUN FAILED
16/09/2004 13:06:25: Regression test on Calculator.cpp: RUN SUCCESS
16/09/2004 13:06:38: Regression test on ComplexTypeAll.cpp: RUN FAILED
16/09/2004 13:06:51: Regression test on Enumeration.cpp: RUN FAILED
16/09/2004 13:07:05: Regression test on ExceptionTest.cpp: RUN SUCCESS
16/09/2004 13:07:17: Regression test on ExtensibilityQuery.cpp: RUN FAILED
16/09/2004 13:07:31: Regression test on FaultMapping.cpp: RUN SUCCESS
16/09/2004 13:07:47: Regression test on InteropTestRound1.cpp: RUN SUCCESS
16/09/2004 13:07:54: Regression test on LargeReturningString.cpp: BUILD
FAILED
16/09/2004 13:08:07: Regression test on ManyTypeRefRoot.cpp: RUN FAILED
16/09/2004 13:08:20: Regression test on MathOps.cpp: RUN FAILED
16/09/2004 13:08:32: Regression test on RecurseTypes.cpp: RUN FAILED
16/09/2004 13:08:45: Regression test on RpcHttpHeaderTest1.cpp: RUN SUCCESS
16/09/2004 13:08:58: Regression test on RpcHttpHeaderTest2.cpp: RUN SUCCESS
16/09/2004 13:09:11: Regression test on RpcHttpHeaderTest3.cpp: RUN SUCCESS
16/09/2004 13:09:24: Regression test on RpcHttpHeaderTest4.cpp: RUN SUCCESS
16/09/2004 13:09:37: Regression test on RpcHttpHeaderTest5.cpp: RUN SUCCESS
16/09/2004 13:09:50: Regression test on RpcHttpHeaderTest7.cpp: RUN SUCCESS
16/09/2004 13:10:03: Regression test on RpcHttpHeaderTest8.cpp: RUN SUCCESS
16/09/2004 13:10:16: Regression test on RpcSoapHeaderTest1.cpp: RUN SUCCESS
16/09/2004 13:10:29: Regression test on RpcSoapHeaderTest10.cpp: RUN
SUCCESS
16/09/2004 13:10:42: Regression test on RpcSoapHeaderTest2.cpp: RUN SUCCESS
16/09/2004 13:10:55: Regression test on RpcSoapHeaderTest3.cpp: RUN SUCCESS
16/09/2004 13:11:08: Regression test on RpcSoapHeaderTest4.cpp: RUN SUCCESS
16/09/2004 13:11:21: Regression test on RpcSoapHeaderTest6.cpp: RUN SUCCESS
16/09/2004 13:11:34: Regression test on RpcSoapHeaderTest8.cpp: RUN SUCCESS
16/09/2004 13:11:47: Regression test on RpcSoapHeaderTest9.cpp: RUN SUCCESS
16/09/2004 13:11:59: Regression test on SimpleArray.cpp: RUN SUCCESS
16/09/2004 13:12:12: Regression test on SimpleRef.cpp: RUN SUCCESS
16/09/2004 13:12:24: Regression test on SimpleTypeArray.cpp: RUN FAILED
16/09/2004 13:12:38: Regression test on SimpleTypeInnerUnbounded.cpp: RUN
FAILED
16/09/2004 13:12:50: Regression test on
SimpleTypeInnerUnboundedInOutput.cpp: RUN FAILED
16/09/2004 13:13:44: Regression test on inquire_v2.cpp: RUN FAILED
16/09/2004 13:13:59: Regression test on AxisBench.cpp: RUN FAILED
16/09/2004 13:14:11: Regression test on Calculator.cpp: RUN FAILED
16/09/2004 13:14:24: Regression test on ComplexTypeAll.cpp: RUN FAILED
16/09/2004 13:14:37: Regression test on Enumeration.cpp: RUN FAILED
16/09/2004 13:14:51: Regression test on ExceptionTest.cpp: RUN SUCCESS
16/09/2004 13:15:03: Regression test on ExtensibilityQuery.cpp: RUN FAILED
16/09/2004 13:15:17: Regression test on FaultMapping.cpp: RUN SUCCESS
16/09/2004 13:15:33: Regression test on InteropTestRound1.cpp: RUN SUCCESS
16/09/2004 13:15:44: Regression test on LargeReturningString.cpp: BUILD
FAILED
16/09/2004 13:15:57: Regression test on ManyTypeRefRoot.cpp: RUN FAILED
16/09/2004 13:16:09: Regression test on MathOps.cpp: RUN FAILED
16/09/2004 13:16:22: Regression test on RecurseTypes.cpp: RUN FAILED
16/09/2004 13:16:35: Regression test on RpcHttpHeaderTest1.cpp: RUN SUCCESS
16/09/2004 13:16:48: Regression test on RpcHttpHeaderTest2.cpp: RUN SUCCESS
16/09/2004 13:17:01: Regression test on RpcHttpHeaderTest3.cpp: RUN SUCCESS
16/09/2004 13:17:14: Regression test on RpcHttpHeaderTest4.cpp: RUN SUCCESS
16/09/2004 13:17:29: Regression test on RpcHttpHeaderTest5.cpp: RUN SUCCESS
16/09/2004 13:17:42: Regression test on RpcHttpHeaderTest7.cpp: RUN SUCCESS
16/09/2004 13:17:55: Regression test on RpcHttpHeaderTest8.cpp: RUN SUCCESS
16/09/2004 13:18:08: Regression test on RpcSoapHeaderTest1.cpp: RUN SUCCESS
16/09/2004 13:18:21: Regression test on RpcSoapHeaderTest10.cpp: RUN
SUCCESS
16/09/2004 13:18:34: Regression test on RpcSoapHeaderTest2.cpp: RUN SUCCESS
16/09/2004 13:18:47: Regression test on RpcSoapHeaderTest3.cpp: RUN SUCCESS
16/09/2004 13:19:00: Regression test on RpcSoapHeaderTest4.cpp: RUN SUCCESS
16/09/2004 13:19:13: Regression test on RpcSoapHeaderTest6.cpp: RUN SUCCESS
16/09/2004 13:19:25: Regression test on RpcSoapHeaderTest8.cpp: BUILD
FAILED
16/09/2004 13:19:38: Regression test on RpcSoapHeaderTest9.cpp: RUN SUCCESS
16/09/2004 13:19:50: Regression test on SimpleArray.cpp: RUN SUCCESS
16/09/2004 13:20:03: Regression test on SimpleRef.cpp: RUN SUCCESS
16/09/2004 13:20:15: Regression test on SimpleTypeArray.cpp: RUN FAILED
16/09/2004 13:20:29: Regression test on SimpleTypeInnerUnbounded.cpp: RUN
FAILED
16/09/2004 13:20:41: Regression test on
SimpleTypeInnerUnboundedInOutput.cpp: RUN FAILED
16/09/2004 13:21:12: Regression test on inquire_v2.cpp: BUILD FAILED



#### buildTestCase.log has been removed from this note on September 16 2004
by Fred Preston



Mime
View raw message