axis-c-dev mailing list archives

Site index · List index
Message view « Date » · « Thread »
Top « Date » · « Thread »
From Paul Fremantle <...@hursley.ibm.com>
Subject Re: [test-results]Axis C++ Autobuild and regression test
Date Mon, 13 Sep 2004 18:44:22 GMT
Hey Damitha...

Very cool!

Paul

Damitha Kumarage wrote:

>10/09/2004 10:31:08: Regression test on AxisBench.cpp: RUN FAILED
>10/09/2004 10:31:20: Regression test on Calculator.cpp: RUN SUCCESS
>10/09/2004 10:31:33: Regression test on ComplexTypeAll.cpp: RUN FAILED
>10/09/2004 10:31:47: Regression test on Enumeration.cpp: RUN FAILED
>10/09/2004 10:32:01: Regression test on ExceptionTest.cpp: RUN SUCCESS
>10/09/2004 10:32:14: Regression test on ExtensibilityQuery.cpp: RUN FAILED
>10/09/2004 10:32:29: Regression test on FaultMapping.cpp: RUN SUCCESS
>10/09/2004 10:33:26: Regression test on inquire_v2.cpp: RUN FAILED
>10/09/2004 10:33:43: Regression test on InteropTestRound1.cpp: RUN SUCCESS
>10/09/2004 10:33:56: Regression test on LargeReturningString.cpp: RUN FAILED
>10/09/2004 10:34:09: Regression test on ManyTypeRefRoot.cpp: RUN FAILED
>10/09/2004 10:34:22: Regression test on MathOps.cpp: RUN FAILED
>10/09/2004 10:34:35: Regression test on RecurseTypes.cpp: RUN FAILED
>10/09/2004 10:34:49: Regression test on RpcHttpHeaderTest1.cpp: RUN SUCCESS
>10/09/2004 10:35:03: Regression test on RpcHttpHeaderTest2.cpp: RUN SUCCESS
>10/09/2004 10:35:16: Regression test on RpcHttpHeaderTest3.cpp: RUN SUCCESS
>10/09/2004 10:35:30: Regression test on RpcHttpHeaderTest4.cpp: RUN SUCCESS
>10/09/2004 10:35:43: Regression test on RpcHttpHeaderTest5.cpp: RUN SUCCESS
>10/09/2004 10:35:58: Regression test on RpcHttpHeaderTest7.cpp: RUN SUCCESS
>10/09/2004 10:36:12: Regression test on RpcHttpHeaderTest8.cpp: RUN SUCCESS
>10/09/2004 10:36:25: Regression test on RpcSoapHeaderTest10.cpp: RUN SUCCESS
>10/09/2004 10:36:39: Regression test on RpcSoapHeaderTest1.cpp: RUN SUCCESS
>10/09/2004 10:36:53: Regression test on RpcSoapHeaderTest2.cpp: RUN SUCCESS
>10/09/2004 10:37:07: Regression test on RpcSoapHeaderTest3.cpp: RUN SUCCESS
>10/09/2004 10:37:21: Regression test on RpcSoapHeaderTest4.cpp: RUN SUCCESS
>10/09/2004 10:37:35: Regression test on RpcSoapHeaderTest6.cpp: RUN SUCCESS
>10/09/2004 10:37:48: Regression test on RpcSoapHeaderTest8.cpp: BUILD FAILED
>10/09/2004 10:38:02: Regression test on RpcSoapHeaderTest9.cpp: RUN SUCCESS
>10/09/2004 10:38:15: Regression test on SimpleArray.cpp: RUN SUCCESS
>10/09/2004 10:38:28: Regression test on SimpleRef.cpp: RUN SUCCESS
>10/09/2004 10:38:36: Regression test on SimpleTypeArray.cpp: BUILD FAILED
>10/09/2004 10:38:48: Regression test on SimpleTypeInnerUnboundedInOutput.cpp: RUN FAILED
>10/09/2004 10:39:01: Regression test on SimpleTypeInnerUnbounded.cpp: BUILD FAILED
>10/09/2004 10:39:17: Regression test on AxisBench.cpp: RUN FAILED
>10/09/2004 10:39:30: Regression test on Calculator.cpp: RUN FAILED
>10/09/2004 10:39:38: Regression test on ComplexTypeAll.cpp: BUILD FAILED
>10/09/2004 10:39:52: Regression test on Enumeration.cpp: RUN FAILED
>10/09/2004 10:40:06: Regression test on ExceptionTest.cpp: RUN SUCCESS
>10/09/2004 10:40:19: Regression test on ExtensibilityQuery.cpp: RUN FAILED
>10/09/2004 10:40:34: Regression test on FaultMapping.cpp: RUN SUCCESS
>10/09/2004 10:44:37: Regression test on inquire_v2.cpp: RUN FAILED
>10/09/2004 10:44:54: Regression test on InteropTestRound1.cpp: RUN SUCCESS
>10/09/2004 10:45:07: Regression test on LargeReturningString.cpp: RUN FAILED
>10/09/2004 10:45:20: Regression test on ManyTypeRefRoot.cpp: RUN FAILED
>10/09/2004 10:45:34: Regression test on MathOps.cpp: RUN FAILED
>10/09/2004 10:45:47: Regression test on RecurseTypes.cpp: RUN FAILED
>10/09/2004 10:46:00: Regression test on RpcHttpHeaderTest1.cpp: RUN SUCCESS
>10/09/2004 10:46:14: Regression test on RpcHttpHeaderTest2.cpp: RUN SUCCESS
>10/09/2004 10:46:28: Regression test on RpcHttpHeaderTest3.cpp: RUN SUCCESS
>10/09/2004 10:46:41: Regression test on RpcHttpHeaderTest4.cpp: RUN SUCCESS
>10/09/2004 10:46:55: Regression test on RpcHttpHeaderTest5.cpp: RUN SUCCESS
>10/09/2004 10:47:08: Regression test on RpcHttpHeaderTest7.cpp: RUN SUCCESS
>10/09/2004 10:47:22: Regression test on RpcHttpHeaderTest8.cpp: RUN SUCCESS
>10/09/2004 10:47:35: Regression test on RpcSoapHeaderTest10.cpp: RUN SUCCESS
>10/09/2004 10:47:49: Regression test on RpcSoapHeaderTest1.cpp: RUN SUCCESS
>10/09/2004 10:48:03: Regression test on RpcSoapHeaderTest2.cpp: RUN SUCCESS
>10/09/2004 10:48:16: Regression test on RpcSoapHeaderTest3.cpp: RUN SUCCESS
>10/09/2004 10:48:30: Regression test on RpcSoapHeaderTest4.cpp: RUN SUCCESS
>10/09/2004 10:48:44: Regression test on RpcSoapHeaderTest6.cpp: RUN SUCCESS
>10/09/2004 10:48:57: Regression test on RpcSoapHeaderTest8.cpp: RUN SUCCESS
>10/09/2004 10:49:10: Regression test on RpcSoapHeaderTest9.cpp: RUN SUCCESS
>10/09/2004 10:49:23: Regression test on SimpleArray.cpp: RUN SUCCESS
>10/09/2004 10:49:36: Regression test on SimpleRef.cpp: RUN SUCCESS
>10/09/2004 10:49:49: Regression test on SimpleTypeArray.cpp: RUN FAILED
>10/09/2004 10:50:02: Regression test on SimpleTypeInnerUnboundedInOutput.cpp: RUN FAILED
>10/09/2004 10:50:16: Regression test on SimpleTypeInnerUnbounded.cpp: RUN FAILED
>  
>


Mime
View raw message