axis-c-dev mailing list archives

Site index · List index
Message view « Date » · « Thread »
Top « Date » · « Thread »
From damitha kumarage <dami...@opensource.lk>
Subject [test-results]Axis C++ Autobuild and regression test
Date Mon, 20 Sep 2004 21:30:00 GMT
21/09/2004 03:06:04: Regression test on AxisBench.cpp: RUN FAILED
21/09/2004 03:06:16: Regression test on Calculator.cpp: RUN SUCCESS
21/09/2004 03:06:29: Regression test on ComplexTypeAll.cpp: RUN FAILED
21/09/2004 03:06:42: Regression test on Enumeration.cpp: RUN FAILED
21/09/2004 03:06:56: Regression test on ExceptionTest.cpp: RUN SUCCESS
21/09/2004 03:07:08: Regression test on ExtensibilityQuery.cpp: RUN FAILED
21/09/2004 03:07:22: Regression test on FaultMapping.cpp: RUN SUCCESS
21/09/2004 03:07:38: Regression test on InteropTestRound1.cpp: RUN SUCCESS
21/09/2004 03:07:49: Regression test on LargeReturningString.cpp: BUILD FAILED
21/09/2004 03:08:01: Regression test on ManyTypeRefRoot.cpp: RUN FAILED
21/09/2004 03:08:09: Regression test on MathOps.cpp: BUILD FAILED
21/09/2004 03:08:22: Regression test on RecurseTypes.cpp: RUN FAILED
21/09/2004 03:08:35: Regression test on RpcHttpHeaderTest1.cpp: RUN SUCCESS
21/09/2004 03:08:48: Regression test on RpcHttpHeaderTest2.cpp: RUN SUCCESS
21/09/2004 03:09:01: Regression test on RpcHttpHeaderTest3.cpp: RUN SUCCESS
21/09/2004 03:09:14: Regression test on RpcHttpHeaderTest4.cpp: RUN SUCCESS
21/09/2004 03:09:27: Regression test on RpcHttpHeaderTest5.cpp: RUN SUCCESS
21/09/2004 03:09:40: Regression test on RpcHttpHeaderTest7.cpp: RUN SUCCESS
21/09/2004 03:09:53: Regression test on RpcHttpHeaderTest8.cpp: RUN SUCCESS
21/09/2004 03:10:06: Regression test on RpcSoapHeaderTest1.cpp: RUN SUCCESS
21/09/2004 03:10:19: Regression test on RpcSoapHeaderTest10.cpp: RUN SUCCESS
21/09/2004 03:10:32: Regression test on RpcSoapHeaderTest2.cpp: RUN SUCCESS
21/09/2004 03:10:45: Regression test on RpcSoapHeaderTest3.cpp: RUN SUCCESS
21/09/2004 03:10:58: Regression test on RpcSoapHeaderTest4.cpp: RUN SUCCESS
21/09/2004 03:11:11: Regression test on RpcSoapHeaderTest6.cpp: RUN SUCCESS
21/09/2004 03:11:24: Regression test on RpcSoapHeaderTest8.cpp: RUN SUCCESS
21/09/2004 03:11:36: Regression test on RpcSoapHeaderTest9.cpp: RUN SUCCESS
21/09/2004 03:11:48: Regression test on SimpleArray.cpp: RUN SUCCESS
21/09/2004 03:12:01: Regression test on SimpleRef.cpp: RUN SUCCESS
21/09/2004 03:12:10: Regression test on SimpleTypeArray.cpp: BUILD FAILED
21/09/2004 03:12:24: Regression test on SimpleTypeInnerUnbounded.cpp: RUN FAILED
21/09/2004 03:12:36: Regression test on SimpleTypeInnerUnboundedInOutput.cpp: RUN FAILED
21/09/2004 03:12:55: Regression test on inquire_v2.cpp: BUILD FAILED
21/09/2004 03:13:11: Regression test on AxisBench.cpp: RUN FAILED
21/09/2004 03:13:19: Regression test on Calculator.cpp: BUILD FAILED
21/09/2004 03:13:32: Regression test on ComplexTypeAll.cpp: RUN FAILED
21/09/2004 03:13:46: Regression test on Enumeration.cpp: RUN FAILED
21/09/2004 03:13:59: Regression test on ExceptionTest.cpp: RUN SUCCESS
21/09/2004 03:14:09: Regression test on ExtensibilityQuery.cpp: BUILD FAILED
21/09/2004 03:14:23: Regression test on FaultMapping.cpp: RUN SUCCESS
21/09/2004 03:14:39: Regression test on InteropTestRound1.cpp: RUN SUCCESS
21/09/2004 03:14:49: Regression test on LargeReturningString.cpp: BUILD FAILED
21/09/2004 03:15:02: Regression test on ManyTypeRefRoot.cpp: RUN FAILED
21/09/2004 03:15:15: Regression test on MathOps.cpp: RUN FAILED
21/09/2004 03:15:24: Regression test on RecurseTypes.cpp: BUILD FAILED
21/09/2004 03:15:37: Regression test on RpcHttpHeaderTest1.cpp: RUN SUCCESS
21/09/2004 03:15:50: Regression test on RpcHttpHeaderTest2.cpp: RUN SUCCESS
21/09/2004 03:15:59: Regression test on RpcHttpHeaderTest3.cpp: BUILD FAILED
21/09/2004 03:16:10: Regression test on RpcHttpHeaderTest4.cpp: BUILD FAILED
21/09/2004 03:16:23: Regression test on RpcHttpHeaderTest5.cpp: RUN SUCCESS
21/09/2004 03:16:36: Regression test on RpcHttpHeaderTest7.cpp: RUN SUCCESS
21/09/2004 03:16:49: Regression test on RpcHttpHeaderTest8.cpp: BUILD FAILED
21/09/2004 03:17:02: Regression test on RpcSoapHeaderTest1.cpp: RUN SUCCESS
21/09/2004 03:17:14: Regression test on RpcSoapHeaderTest10.cpp: RUN SUCCESS
21/09/2004 03:17:27: Regression test on RpcSoapHeaderTest2.cpp: RUN SUCCESS
21/09/2004 03:17:40: Regression test on RpcSoapHeaderTest3.cpp: RUN SUCCESS
21/09/2004 03:17:53: Regression test on RpcSoapHeaderTest4.cpp: RUN SUCCESS
21/09/2004 03:17:59: Regression test on RpcSoapHeaderTest6.cpp: BUILD FAILED
21/09/2004 03:18:12: Regression test on RpcSoapHeaderTest8.cpp: RUN SUCCESS
21/09/2004 03:18:15: Regression test on RpcSoapHeaderTest9.cpp: BUILD FAILED
21/09/2004 03:18:27: Regression test on SimpleArray.cpp: RUN SUCCESS
21/09/2004 03:18:39: Regression test on SimpleRef.cpp: RUN SUCCESS
21/09/2004 03:18:52: Regression test on SimpleTypeArray.cpp: RUN FAILED
21/09/2004 03:19:05: Regression test on SimpleTypeInnerUnbounded.cpp: RUN FAILED
21/09/2004 03:19:18: Regression test on SimpleTypeInnerUnboundedInOutput.cpp: RUN FAILED
21/09/2004 03:23:19: Regression test on inquire_v2.cpp: RUN FAILED

Mime
View raw message