axis-c-dev mailing list archives

Site index · List index
Message view « Date » · « Thread »
Top « Date » · « Thread »
From damitha kumarage <dami...@opensource.lk>
Subject [test-results]Axis C++ Autobuild and regression test
Date Mon, 20 Sep 2004 19:30:00 GMT
21/09/2004 01:06:04: Regression test on AxisBench.cpp: RUN FAILED
21/09/2004 01:06:16: Regression test on Calculator.cpp: RUN SUCCESS
21/09/2004 01:06:29: Regression test on ComplexTypeAll.cpp: RUN FAILED
21/09/2004 01:06:42: Regression test on Enumeration.cpp: RUN FAILED
21/09/2004 01:06:56: Regression test on ExceptionTest.cpp: RUN SUCCESS
21/09/2004 01:07:08: Regression test on ExtensibilityQuery.cpp: RUN FAILED
21/09/2004 01:07:22: Regression test on FaultMapping.cpp: RUN SUCCESS
21/09/2004 01:07:38: Regression test on InteropTestRound1.cpp: RUN SUCCESS
21/09/2004 01:07:49: Regression test on LargeReturningString.cpp: BUILD FAILED
21/09/2004 01:08:02: Regression test on ManyTypeRefRoot.cpp: RUN FAILED
21/09/2004 01:08:14: Regression test on MathOps.cpp: RUN FAILED
21/09/2004 01:08:27: Regression test on RecurseTypes.cpp: RUN FAILED
21/09/2004 01:08:40: Regression test on RpcHttpHeaderTest1.cpp: RUN SUCCESS
21/09/2004 01:08:53: Regression test on RpcHttpHeaderTest2.cpp: RUN SUCCESS
21/09/2004 01:09:06: Regression test on RpcHttpHeaderTest3.cpp: RUN SUCCESS
21/09/2004 01:09:19: Regression test on RpcHttpHeaderTest4.cpp: RUN SUCCESS
21/09/2004 01:09:32: Regression test on RpcHttpHeaderTest5.cpp: RUN SUCCESS
21/09/2004 01:09:45: Regression test on RpcHttpHeaderTest7.cpp: RUN SUCCESS
21/09/2004 01:09:58: Regression test on RpcHttpHeaderTest8.cpp: RUN SUCCESS
21/09/2004 01:10:11: Regression test on RpcSoapHeaderTest1.cpp: RUN SUCCESS
21/09/2004 01:10:24: Regression test on RpcSoapHeaderTest10.cpp: RUN SUCCESS
21/09/2004 01:10:36: Regression test on RpcSoapHeaderTest2.cpp: RUN SUCCESS
21/09/2004 01:10:49: Regression test on RpcSoapHeaderTest3.cpp: RUN SUCCESS
21/09/2004 01:11:02: Regression test on RpcSoapHeaderTest4.cpp: RUN SUCCESS
21/09/2004 01:11:15: Regression test on RpcSoapHeaderTest6.cpp: RUN SUCCESS
21/09/2004 01:11:28: Regression test on RpcSoapHeaderTest8.cpp: RUN SUCCESS
21/09/2004 01:11:41: Regression test on RpcSoapHeaderTest9.cpp: RUN SUCCESS
21/09/2004 01:11:53: Regression test on SimpleArray.cpp: RUN SUCCESS
21/09/2004 01:12:05: Regression test on SimpleRef.cpp: RUN SUCCESS
21/09/2004 01:12:18: Regression test on SimpleTypeArray.cpp: RUN FAILED
21/09/2004 01:12:31: Regression test on SimpleTypeInnerUnbounded.cpp: RUN FAILED
21/09/2004 01:12:44: Regression test on SimpleTypeInnerUnboundedInOutput.cpp: RUN FAILED
21/09/2004 01:13:35: Regression test on inquire_v2.cpp: BUILD FAILED
21/09/2004 01:13:50: Regression test on AxisBench.cpp: RUN FAILED
21/09/2004 01:14:02: Regression test on Calculator.cpp: RUN FAILED
21/09/2004 01:14:15: Regression test on ComplexTypeAll.cpp: RUN FAILED
21/09/2004 01:14:28: Regression test on Enumeration.cpp: RUN FAILED
21/09/2004 01:14:42: Regression test on ExceptionTest.cpp: RUN SUCCESS
21/09/2004 01:14:54: Regression test on ExtensibilityQuery.cpp: RUN FAILED
21/09/2004 01:15:08: Regression test on FaultMapping.cpp: RUN SUCCESS
21/09/2004 01:15:24: Regression test on InteropTestRound1.cpp: RUN SUCCESS
21/09/2004 01:15:35: Regression test on LargeReturningString.cpp: BUILD FAILED
21/09/2004 01:15:48: Regression test on ManyTypeRefRoot.cpp: RUN FAILED
21/09/2004 01:16:00: Regression test on MathOps.cpp: RUN FAILED
21/09/2004 01:16:13: Regression test on RecurseTypes.cpp: RUN FAILED
21/09/2004 01:16:26: Regression test on RpcHttpHeaderTest1.cpp: RUN SUCCESS
21/09/2004 01:16:39: Regression test on RpcHttpHeaderTest2.cpp: RUN SUCCESS
21/09/2004 01:16:51: Regression test on RpcHttpHeaderTest3.cpp: RUN SUCCESS
21/09/2004 01:17:04: Regression test on RpcHttpHeaderTest4.cpp: RUN SUCCESS
21/09/2004 01:17:17: Regression test on RpcHttpHeaderTest5.cpp: RUN SUCCESS
21/09/2004 01:17:30: Regression test on RpcHttpHeaderTest7.cpp: RUN SUCCESS
21/09/2004 01:17:43: Regression test on RpcHttpHeaderTest8.cpp: RUN SUCCESS
21/09/2004 01:17:56: Regression test on RpcSoapHeaderTest1.cpp: RUN SUCCESS
21/09/2004 01:18:09: Regression test on RpcSoapHeaderTest10.cpp: RUN SUCCESS
21/09/2004 01:18:22: Regression test on RpcSoapHeaderTest2.cpp: RUN SUCCESS
21/09/2004 01:18:35: Regression test on RpcSoapHeaderTest3.cpp: RUN SUCCESS
21/09/2004 01:18:48: Regression test on RpcSoapHeaderTest4.cpp: RUN SUCCESS
21/09/2004 01:19:00: Regression test on RpcSoapHeaderTest6.cpp: RUN SUCCESS
21/09/2004 01:19:14: Regression test on RpcSoapHeaderTest8.cpp: RUN SUCCESS
21/09/2004 01:19:26: Regression test on RpcSoapHeaderTest9.cpp: RUN SUCCESS
21/09/2004 01:19:38: Regression test on SimpleArray.cpp: RUN SUCCESS
21/09/2004 01:19:51: Regression test on SimpleRef.cpp: RUN SUCCESS
21/09/2004 01:20:03: Regression test on SimpleTypeArray.cpp: RUN FAILED
21/09/2004 01:20:17: Regression test on SimpleTypeInnerUnbounded.cpp: RUN FAILED
21/09/2004 01:20:28: Regression test on SimpleTypeInnerUnboundedInOutput.cpp: BUILD FAILED
21/09/2004 01:24:29: Regression test on inquire_v2.cpp: RUN FAILED

Mime
View raw message