axis-c-dev mailing list archives

Site index · List index
Message view « Date » · « Thread »
Top « Date » · « Thread »
From damitha kumarage <dami...@opensource.lk>
Subject [test-results]Axis C++ Autobuild and regression test
Date Mon, 20 Sep 2004 17:30:00 GMT
20/09/2004 23:06:04: Regression test on AxisBench.cpp: RUN FAILED
20/09/2004 23:06:16: Regression test on Calculator.cpp: RUN SUCCESS
20/09/2004 23:06:29: Regression test on ComplexTypeAll.cpp: RUN FAILED
20/09/2004 23:06:42: Regression test on Enumeration.cpp: RUN FAILED
20/09/2004 23:06:55: Regression test on ExceptionTest.cpp: RUN SUCCESS
20/09/2004 23:07:08: Regression test on ExtensibilityQuery.cpp: RUN FAILED
20/09/2004 23:07:22: Regression test on FaultMapping.cpp: RUN SUCCESS
20/09/2004 23:07:37: Regression test on InteropTestRound1.cpp: RUN SUCCESS
20/09/2004 23:07:48: Regression test on LargeReturningString.cpp: BUILD FAILED
20/09/2004 23:08:01: Regression test on ManyTypeRefRoot.cpp: RUN FAILED
20/09/2004 23:08:13: Regression test on MathOps.cpp: RUN FAILED
20/09/2004 23:08:21: Regression test on RecurseTypes.cpp: BUILD FAILED
20/09/2004 23:08:34: Regression test on RpcHttpHeaderTest1.cpp: RUN SUCCESS
20/09/2004 23:08:47: Regression test on RpcHttpHeaderTest2.cpp: RUN SUCCESS
20/09/2004 23:09:00: Regression test on RpcHttpHeaderTest3.cpp: RUN SUCCESS
20/09/2004 23:09:13: Regression test on RpcHttpHeaderTest4.cpp: RUN SUCCESS
20/09/2004 23:09:26: Regression test on RpcHttpHeaderTest5.cpp: RUN SUCCESS
20/09/2004 23:09:39: Regression test on RpcHttpHeaderTest7.cpp: RUN SUCCESS
20/09/2004 23:09:52: Regression test on RpcHttpHeaderTest8.cpp: RUN SUCCESS
20/09/2004 23:10:05: Regression test on RpcSoapHeaderTest1.cpp: RUN SUCCESS
20/09/2004 23:10:18: Regression test on RpcSoapHeaderTest10.cpp: RUN SUCCESS
20/09/2004 23:10:31: Regression test on RpcSoapHeaderTest2.cpp: RUN SUCCESS
20/09/2004 23:10:44: Regression test on RpcSoapHeaderTest3.cpp: RUN SUCCESS
20/09/2004 23:10:57: Regression test on RpcSoapHeaderTest4.cpp: RUN SUCCESS
20/09/2004 23:11:10: Regression test on RpcSoapHeaderTest6.cpp: RUN SUCCESS
20/09/2004 23:11:23: Regression test on RpcSoapHeaderTest8.cpp: RUN SUCCESS
20/09/2004 23:11:35: Regression test on RpcSoapHeaderTest9.cpp: RUN SUCCESS
20/09/2004 23:11:48: Regression test on SimpleArray.cpp: RUN SUCCESS
20/09/2004 23:12:00: Regression test on SimpleRef.cpp: RUN SUCCESS
20/09/2004 23:12:12: Regression test on SimpleTypeArray.cpp: RUN FAILED
20/09/2004 23:12:26: Regression test on SimpleTypeInnerUnbounded.cpp: RUN FAILED
20/09/2004 23:12:38: Regression test on SimpleTypeInnerUnboundedInOutput.cpp: RUN FAILED
20/09/2004 23:13:33: Regression test on inquire_v2.cpp: RUN FAILED
20/09/2004 23:13:48: Regression test on AxisBench.cpp: RUN FAILED
20/09/2004 23:14:00: Regression test on Calculator.cpp: RUN FAILED
20/09/2004 23:14:13: Regression test on ComplexTypeAll.cpp: RUN FAILED
20/09/2004 23:14:26: Regression test on Enumeration.cpp: RUN FAILED
20/09/2004 23:14:39: Regression test on ExceptionTest.cpp: RUN SUCCESS
20/09/2004 23:14:52: Regression test on ExtensibilityQuery.cpp: RUN FAILED
20/09/2004 23:15:06: Regression test on FaultMapping.cpp: RUN SUCCESS
20/09/2004 23:15:22: Regression test on InteropTestRound1.cpp: RUN SUCCESS
20/09/2004 23:15:29: Regression test on LargeReturningString.cpp: BUILD FAILED
20/09/2004 23:15:42: Regression test on ManyTypeRefRoot.cpp: RUN FAILED
20/09/2004 23:15:54: Regression test on MathOps.cpp: RUN FAILED
20/09/2004 23:16:10: Regression test on RecurseTypes.cpp: RUN FAILED
20/09/2004 23:16:23: Regression test on RpcHttpHeaderTest1.cpp: RUN SUCCESS
20/09/2004 23:16:35: Regression test on RpcHttpHeaderTest2.cpp: RUN SUCCESS
20/09/2004 23:16:48: Regression test on RpcHttpHeaderTest3.cpp: RUN SUCCESS
20/09/2004 23:17:01: Regression test on RpcHttpHeaderTest4.cpp: RUN SUCCESS
20/09/2004 23:17:14: Regression test on RpcHttpHeaderTest5.cpp: RUN SUCCESS
20/09/2004 23:17:27: Regression test on RpcHttpHeaderTest7.cpp: RUN SUCCESS
20/09/2004 23:17:40: Regression test on RpcHttpHeaderTest8.cpp: RUN SUCCESS
20/09/2004 23:17:53: Regression test on RpcSoapHeaderTest1.cpp: RUN SUCCESS
20/09/2004 23:18:06: Regression test on RpcSoapHeaderTest10.cpp: RUN SUCCESS
20/09/2004 23:18:19: Regression test on RpcSoapHeaderTest2.cpp: RUN SUCCESS
20/09/2004 23:18:32: Regression test on RpcSoapHeaderTest3.cpp: RUN SUCCESS
20/09/2004 23:18:44: Regression test on RpcSoapHeaderTest4.cpp: RUN SUCCESS
20/09/2004 23:18:57: Regression test on RpcSoapHeaderTest6.cpp: RUN SUCCESS
20/09/2004 23:19:10: Regression test on RpcSoapHeaderTest8.cpp: RUN SUCCESS
20/09/2004 23:19:23: Regression test on RpcSoapHeaderTest9.cpp: BUILD FAILED
20/09/2004 23:19:35: Regression test on SimpleArray.cpp: RUN SUCCESS
20/09/2004 23:19:47: Regression test on SimpleRef.cpp: BUILD FAILED
20/09/2004 23:19:59: Regression test on SimpleTypeArray.cpp: RUN FAILED
20/09/2004 23:20:13: Regression test on SimpleTypeInnerUnbounded.cpp: RUN FAILED
20/09/2004 23:20:23: Regression test on SimpleTypeInnerUnboundedInOutput.cpp: BUILD FAILED
20/09/2004 23:24:24: Regression test on inquire_v2.cpp: RUN FAILED

Mime
View raw message