axis-c-dev mailing list archives

Site index · List index
Message view « Date » · « Thread »
Top « Date » · « Thread »
From damitha kumarage <dami...@opensource.lk>
Subject [test-results]Axis C++ Autobuild and regression test
Date Mon, 20 Sep 2004 11:30:01 GMT
20/09/2004 17:06:04: Regression test on AxisBench.cpp: RUN FAILED
20/09/2004 17:06:16: Regression test on Calculator.cpp: RUN SUCCESS
20/09/2004 17:06:29: Regression test on ComplexTypeAll.cpp: RUN FAILED
20/09/2004 17:06:42: Regression test on Enumeration.cpp: RUN FAILED
20/09/2004 17:06:55: Regression test on ExceptionTest.cpp: RUN SUCCESS
20/09/2004 17:07:08: Regression test on ExtensibilityQuery.cpp: RUN FAILED
20/09/2004 17:07:22: Regression test on FaultMapping.cpp: RUN SUCCESS
20/09/2004 17:07:37: Regression test on InteropTestRound1.cpp: RUN SUCCESS
20/09/2004 17:07:48: Regression test on LargeReturningString.cpp: BUILD FAILED
20/09/2004 17:08:01: Regression test on ManyTypeRefRoot.cpp: RUN FAILED
20/09/2004 17:08:13: Regression test on MathOps.cpp: RUN FAILED
20/09/2004 17:08:16: Regression test on RecurseTypes.cpp: BUILD FAILED
20/09/2004 17:08:29: Regression test on RpcHttpHeaderTest1.cpp: RUN SUCCESS
20/09/2004 17:08:42: Regression test on RpcHttpHeaderTest2.cpp: RUN SUCCESS
20/09/2004 17:08:55: Regression test on RpcHttpHeaderTest3.cpp: RUN SUCCESS
20/09/2004 17:09:07: Regression test on RpcHttpHeaderTest4.cpp: RUN SUCCESS
20/09/2004 17:09:20: Regression test on RpcHttpHeaderTest5.cpp: RUN SUCCESS
20/09/2004 17:09:33: Regression test on RpcHttpHeaderTest7.cpp: RUN SUCCESS
20/09/2004 17:09:46: Regression test on RpcHttpHeaderTest8.cpp: RUN SUCCESS
20/09/2004 17:09:59: Regression test on RpcSoapHeaderTest1.cpp: BUILD FAILED
20/09/2004 17:10:12: Regression test on RpcSoapHeaderTest10.cpp: RUN SUCCESS
20/09/2004 17:10:25: Regression test on RpcSoapHeaderTest2.cpp: RUN SUCCESS
20/09/2004 17:10:34: Regression test on RpcSoapHeaderTest3.cpp: BUILD FAILED
20/09/2004 17:10:47: Regression test on RpcSoapHeaderTest4.cpp: RUN SUCCESS
20/09/2004 17:11:00: Regression test on RpcSoapHeaderTest6.cpp: RUN SUCCESS
20/09/2004 17:11:13: Regression test on RpcSoapHeaderTest8.cpp: RUN SUCCESS
20/09/2004 17:11:26: Regression test on RpcSoapHeaderTest9.cpp: RUN SUCCESS
20/09/2004 17:11:38: Regression test on SimpleArray.cpp: RUN SUCCESS
20/09/2004 17:11:51: Regression test on SimpleRef.cpp: RUN SUCCESS
20/09/2004 17:12:04: Regression test on SimpleTypeArray.cpp: RUN FAILED
20/09/2004 17:12:18: Regression test on SimpleTypeInnerUnbounded.cpp: RUN FAILED
20/09/2004 17:12:30: Regression test on SimpleTypeInnerUnboundedInOutput.cpp: RUN FAILED
20/09/2004 17:13:25: Regression test on inquire_v2.cpp: RUN FAILED
20/09/2004 17:13:40: Regression test on AxisBench.cpp: RUN FAILED
20/09/2004 17:13:43: Regression test on Calculator.cpp: BUILD FAILED
20/09/2004 17:13:56: Regression test on ComplexTypeAll.cpp: RUN FAILED
20/09/2004 17:14:09: Regression test on Enumeration.cpp: RUN FAILED
20/09/2004 17:14:23: Regression test on ExceptionTest.cpp: RUN SUCCESS
20/09/2004 17:14:35: Regression test on ExtensibilityQuery.cpp: RUN FAILED
20/09/2004 17:14:49: Regression test on FaultMapping.cpp: RUN SUCCESS
20/09/2004 17:15:06: Regression test on InteropTestRound1.cpp: RUN SUCCESS
20/09/2004 17:15:17: Regression test on LargeReturningString.cpp: BUILD FAILED
20/09/2004 17:15:30: Regression test on ManyTypeRefRoot.cpp: RUN FAILED
20/09/2004 17:15:43: Regression test on MathOps.cpp: RUN FAILED
20/09/2004 17:15:56: Regression test on RecurseTypes.cpp: RUN FAILED
20/09/2004 17:16:09: Regression test on RpcHttpHeaderTest1.cpp: RUN SUCCESS
20/09/2004 17:16:22: Regression test on RpcHttpHeaderTest2.cpp: RUN SUCCESS
20/09/2004 17:16:36: Regression test on RpcHttpHeaderTest3.cpp: RUN SUCCESS
20/09/2004 17:16:44: Regression test on RpcHttpHeaderTest4.cpp: BUILD FAILED
20/09/2004 17:16:57: Regression test on RpcHttpHeaderTest5.cpp: RUN SUCCESS
20/09/2004 17:17:10: Regression test on RpcHttpHeaderTest7.cpp: RUN SUCCESS
20/09/2004 17:17:24: Regression test on RpcHttpHeaderTest8.cpp: RUN SUCCESS
20/09/2004 17:17:37: Regression test on RpcSoapHeaderTest1.cpp: RUN SUCCESS
20/09/2004 17:17:50: Regression test on RpcSoapHeaderTest10.cpp: RUN SUCCESS
20/09/2004 17:18:03: Regression test on RpcSoapHeaderTest2.cpp: BUILD FAILED
20/09/2004 17:18:16: Regression test on RpcSoapHeaderTest3.cpp: RUN SUCCESS
20/09/2004 17:18:29: Regression test on RpcSoapHeaderTest4.cpp: RUN SUCCESS
20/09/2004 17:18:42: Regression test on RpcSoapHeaderTest6.cpp: RUN SUCCESS
20/09/2004 17:18:55: Regression test on RpcSoapHeaderTest8.cpp: RUN SUCCESS
20/09/2004 17:19:08: Regression test on RpcSoapHeaderTest9.cpp: RUN SUCCESS
20/09/2004 17:19:21: Regression test on SimpleArray.cpp: RUN SUCCESS
20/09/2004 17:19:33: Regression test on SimpleRef.cpp: RUN SUCCESS
20/09/2004 17:19:46: Regression test on SimpleTypeArray.cpp: RUN FAILED
20/09/2004 17:19:59: Regression test on SimpleTypeInnerUnbounded.cpp: RUN FAILED
20/09/2004 17:20:12: Regression test on SimpleTypeInnerUnboundedInOutput.cpp: RUN FAILED
20/09/2004 17:21:24: Regression test on inquire_v2.cpp: RUN FAILED

Mime
View raw message