axis-c-dev mailing list archives

Site index · List index
Message view « Date » · « Thread »
Top « Date » · « Thread »
From damitha kumarage <dami...@opensource.lk>
Subject [test-results]Axis C++ Autobuild and regression test
Date Mon, 20 Sep 2004 09:30:00 GMT
20/09/2004 15:06:19: Regression test on AxisBench.cpp: RUN FAILED
20/09/2004 15:06:31: Regression test on Calculator.cpp: RUN SUCCESS
20/09/2004 15:06:44: Regression test on ComplexTypeAll.cpp: RUN FAILED
20/09/2004 15:06:57: Regression test on Enumeration.cpp: RUN FAILED
20/09/2004 15:07:10: Regression test on ExceptionTest.cpp: RUN SUCCESS
20/09/2004 15:07:23: Regression test on ExtensibilityQuery.cpp: RUN FAILED
20/09/2004 15:07:37: Regression test on FaultMapping.cpp: RUN SUCCESS
20/09/2004 15:07:53: Regression test on InteropTestRound1.cpp: RUN SUCCESS
20/09/2004 15:08:04: Regression test on LargeReturningString.cpp: BUILD FAILED
20/09/2004 15:08:16: Regression test on ManyTypeRefRoot.cpp: RUN FAILED
20/09/2004 15:08:29: Regression test on MathOps.cpp: RUN FAILED
20/09/2004 15:08:42: Regression test on RecurseTypes.cpp: RUN FAILED
20/09/2004 15:08:55: Regression test on RpcHttpHeaderTest1.cpp: RUN SUCCESS
20/09/2004 15:09:07: Regression test on RpcHttpHeaderTest2.cpp: RUN SUCCESS
20/09/2004 15:09:21: Regression test on RpcHttpHeaderTest3.cpp: RUN SUCCESS
20/09/2004 15:09:34: Regression test on RpcHttpHeaderTest4.cpp: RUN SUCCESS
20/09/2004 15:09:47: Regression test on RpcHttpHeaderTest5.cpp: RUN SUCCESS
20/09/2004 15:10:00: Regression test on RpcHttpHeaderTest7.cpp: RUN SUCCESS
20/09/2004 15:10:13: Regression test on RpcHttpHeaderTest8.cpp: RUN SUCCESS
20/09/2004 15:10:26: Regression test on RpcSoapHeaderTest1.cpp: RUN SUCCESS
20/09/2004 15:10:39: Regression test on RpcSoapHeaderTest10.cpp: RUN SUCCESS
20/09/2004 15:10:52: Regression test on RpcSoapHeaderTest2.cpp: RUN SUCCESS
20/09/2004 15:11:05: Regression test on RpcSoapHeaderTest3.cpp: RUN SUCCESS
20/09/2004 15:11:18: Regression test on RpcSoapHeaderTest4.cpp: RUN SUCCESS
20/09/2004 15:11:31: Regression test on RpcSoapHeaderTest6.cpp: RUN SUCCESS
20/09/2004 15:11:44: Regression test on RpcSoapHeaderTest8.cpp: RUN SUCCESS
20/09/2004 15:11:57: Regression test on RpcSoapHeaderTest9.cpp: RUN SUCCESS
20/09/2004 15:12:09: Regression test on SimpleArray.cpp: RUN SUCCESS
20/09/2004 15:12:21: Regression test on SimpleRef.cpp: RUN SUCCESS
20/09/2004 15:12:34: Regression test on SimpleTypeArray.cpp: RUN FAILED
20/09/2004 15:12:48: Regression test on SimpleTypeInnerUnbounded.cpp: RUN FAILED
20/09/2004 15:13:00: Regression test on SimpleTypeInnerUnboundedInOutput.cpp: RUN FAILED
20/09/2004 15:14:05: Regression test on inquire_v2.cpp: RUN FAILED
20/09/2004 15:14:20: Regression test on AxisBench.cpp: RUN FAILED
20/09/2004 15:14:33: Regression test on Calculator.cpp: RUN FAILED
20/09/2004 15:14:45: Regression test on ComplexTypeAll.cpp: RUN FAILED
20/09/2004 15:14:58: Regression test on Enumeration.cpp: RUN FAILED
20/09/2004 15:15:12: Regression test on ExceptionTest.cpp: RUN SUCCESS
20/09/2004 15:15:25: Regression test on ExtensibilityQuery.cpp: RUN FAILED
20/09/2004 15:15:39: Regression test on FaultMapping.cpp: RUN SUCCESS
20/09/2004 15:15:55: Regression test on InteropTestRound1.cpp: RUN SUCCESS
20/09/2004 15:16:09: Regression test on LargeReturningString.cpp: BUILD FAILED
20/09/2004 15:16:21: Regression test on ManyTypeRefRoot.cpp: RUN FAILED
20/09/2004 15:16:34: Regression test on MathOps.cpp: RUN FAILED
20/09/2004 15:16:43: Regression test on RecurseTypes.cpp: BUILD FAILED
20/09/2004 15:16:56: Regression test on RpcHttpHeaderTest1.cpp: RUN SUCCESS
20/09/2004 15:17:09: Regression test on RpcHttpHeaderTest2.cpp: RUN SUCCESS
20/09/2004 15:17:22: Regression test on RpcHttpHeaderTest3.cpp: RUN SUCCESS
20/09/2004 15:17:35: Regression test on RpcHttpHeaderTest4.cpp: RUN SUCCESS
20/09/2004 15:17:48: Regression test on RpcHttpHeaderTest5.cpp: RUN SUCCESS
20/09/2004 15:18:01: Regression test on RpcHttpHeaderTest7.cpp: RUN SUCCESS
20/09/2004 15:18:14: Regression test on RpcHttpHeaderTest8.cpp: RUN SUCCESS
20/09/2004 15:18:27: Regression test on RpcSoapHeaderTest1.cpp: RUN SUCCESS
20/09/2004 15:18:39: Regression test on RpcSoapHeaderTest10.cpp: RUN SUCCESS
20/09/2004 15:18:52: Regression test on RpcSoapHeaderTest2.cpp: RUN SUCCESS
20/09/2004 15:19:05: Regression test on RpcSoapHeaderTest3.cpp: RUN SUCCESS
20/09/2004 15:19:18: Regression test on RpcSoapHeaderTest4.cpp: RUN SUCCESS
20/09/2004 15:19:31: Regression test on RpcSoapHeaderTest6.cpp: RUN SUCCESS
20/09/2004 15:19:44: Regression test on RpcSoapHeaderTest8.cpp: RUN SUCCESS
20/09/2004 15:19:57: Regression test on RpcSoapHeaderTest9.cpp: RUN SUCCESS
20/09/2004 15:20:10: Regression test on SimpleArray.cpp: RUN SUCCESS
20/09/2004 15:20:22: Regression test on SimpleRef.cpp: RUN SUCCESS
20/09/2004 15:20:35: Regression test on SimpleTypeArray.cpp: RUN FAILED
20/09/2004 15:20:48: Regression test on SimpleTypeInnerUnbounded.cpp: RUN FAILED
20/09/2004 15:21:01: Regression test on SimpleTypeInnerUnboundedInOutput.cpp: RUN FAILED
20/09/2004 15:25:01: Regression test on inquire_v2.cpp: RUN FAILED

Mime
View raw message