axis-c-dev mailing list archives

Site index · List index
Message view « Date » · « Thread »
Top « Date » · « Thread »
From damitha kumarage <dami...@opensource.lk>
Subject [test-results]Axis C++ Autobuild and regression test
Date Thu, 16 Sep 2004 10:30:00 GMT
16/09/2004 16:06:22: Regression test on AxisBench.cpp: RUN FAILED
16/09/2004 16:06:34: Regression test on Calculator.cpp: RUN SUCCESS
16/09/2004 16:06:46: Regression test on ComplexTypeAll.cpp: RUN FAILED
16/09/2004 16:06:59: Regression test on Enumeration.cpp: RUN FAILED
16/09/2004 16:07:13: Regression test on ExceptionTest.cpp: RUN SUCCESS
16/09/2004 16:07:25: Regression test on ExtensibilityQuery.cpp: RUN FAILED
16/09/2004 16:07:39: Regression test on FaultMapping.cpp: RUN SUCCESS
16/09/2004 16:07:55: Regression test on InteropTestRound1.cpp: RUN SUCCESS
16/09/2004 16:08:06: Regression test on LargeReturningString.cpp: BUILD FAILED
16/09/2004 16:08:19: Regression test on ManyTypeRefRoot.cpp: RUN FAILED
16/09/2004 16:08:31: Regression test on MathOps.cpp: RUN FAILED
16/09/2004 16:08:44: Regression test on RecurseTypes.cpp: RUN FAILED
16/09/2004 16:08:56: Regression test on RpcHttpHeaderTest1.cpp: RUN SUCCESS
16/09/2004 16:09:09: Regression test on RpcHttpHeaderTest2.cpp: RUN SUCCESS
16/09/2004 16:09:22: Regression test on RpcHttpHeaderTest3.cpp: RUN SUCCESS
16/09/2004 16:09:35: Regression test on RpcHttpHeaderTest4.cpp: RUN SUCCESS
16/09/2004 16:09:48: Regression test on RpcHttpHeaderTest5.cpp: RUN SUCCESS
16/09/2004 16:10:01: Regression test on RpcHttpHeaderTest7.cpp: RUN SUCCESS
16/09/2004 16:10:14: Regression test on RpcHttpHeaderTest8.cpp: RUN SUCCESS
16/09/2004 16:10:27: Regression test on RpcSoapHeaderTest1.cpp: RUN SUCCESS
16/09/2004 16:10:40: Regression test on RpcSoapHeaderTest10.cpp: RUN SUCCESS
16/09/2004 16:10:53: Regression test on RpcSoapHeaderTest2.cpp: RUN SUCCESS
16/09/2004 16:11:06: Regression test on RpcSoapHeaderTest3.cpp: RUN SUCCESS
16/09/2004 16:11:19: Regression test on RpcSoapHeaderTest4.cpp: RUN SUCCESS
16/09/2004 16:11:32: Regression test on RpcSoapHeaderTest6.cpp: RUN SUCCESS
16/09/2004 16:11:45: Regression test on RpcSoapHeaderTest8.cpp: RUN SUCCESS
16/09/2004 16:11:58: Regression test on RpcSoapHeaderTest9.cpp: RUN SUCCESS
16/09/2004 16:12:10: Regression test on SimpleArray.cpp: RUN SUCCESS
16/09/2004 16:12:22: Regression test on SimpleRef.cpp: RUN SUCCESS
16/09/2004 16:12:32: Regression test on SimpleTypeArray.cpp: BUILD FAILED
16/09/2004 16:12:45: Regression test on SimpleTypeInnerUnbounded.cpp: RUN FAILED
16/09/2004 16:12:58: Regression test on SimpleTypeInnerUnboundedInOutput.cpp: RUN FAILED
16/09/2004 16:13:48: Regression test on inquire_v2.cpp: BUILD FAILED
16/09/2004 16:14:03: Regression test on AxisBench.cpp: RUN FAILED
16/09/2004 16:14:16: Regression test on Calculator.cpp: RUN FAILED
16/09/2004 16:14:28: Regression test on ComplexTypeAll.cpp: RUN FAILED
16/09/2004 16:14:42: Regression test on Enumeration.cpp: RUN FAILED
16/09/2004 16:14:55: Regression test on ExceptionTest.cpp: RUN SUCCESS
16/09/2004 16:15:08: Regression test on ExtensibilityQuery.cpp: RUN FAILED
16/09/2004 16:15:22: Regression test on FaultMapping.cpp: RUN SUCCESS
16/09/2004 16:15:37: Regression test on InteropTestRound1.cpp: RUN SUCCESS
16/09/2004 16:15:48: Regression test on LargeReturningString.cpp: BUILD FAILED
16/09/2004 16:16:04: Regression test on ManyTypeRefRoot.cpp: RUN FAILED
16/09/2004 16:16:17: Regression test on MathOps.cpp: RUN FAILED
16/09/2004 16:16:29: Regression test on RecurseTypes.cpp: RUN FAILED
16/09/2004 16:16:42: Regression test on RpcHttpHeaderTest1.cpp: RUN SUCCESS
16/09/2004 16:16:54: Regression test on RpcHttpHeaderTest2.cpp: RUN SUCCESS
16/09/2004 16:17:06: Regression test on RpcHttpHeaderTest3.cpp: RUN SUCCESS
16/09/2004 16:17:19: Regression test on RpcHttpHeaderTest4.cpp: RUN SUCCESS
16/09/2004 16:17:32: Regression test on RpcHttpHeaderTest5.cpp: RUN SUCCESS
16/09/2004 16:17:34: Regression test on RpcHttpHeaderTest7.cpp: BUILD FAILED
16/09/2004 16:17:47: Regression test on RpcHttpHeaderTest8.cpp: RUN SUCCESS
16/09/2004 16:18:00: Regression test on RpcSoapHeaderTest1.cpp: RUN SUCCESS
16/09/2004 16:18:13: Regression test on RpcSoapHeaderTest10.cpp: RUN SUCCESS
16/09/2004 16:18:26: Regression test on RpcSoapHeaderTest2.cpp: RUN SUCCESS
16/09/2004 16:18:39: Regression test on RpcSoapHeaderTest3.cpp: RUN SUCCESS
16/09/2004 16:18:52: Regression test on RpcSoapHeaderTest4.cpp: RUN SUCCESS
16/09/2004 16:19:04: Regression test on RpcSoapHeaderTest6.cpp: RUN SUCCESS
16/09/2004 16:19:18: Regression test on RpcSoapHeaderTest8.cpp: RUN SUCCESS
16/09/2004 16:19:30: Regression test on RpcSoapHeaderTest9.cpp: RUN SUCCESS
16/09/2004 16:19:39: Regression test on SimpleArray.cpp: BUILD FAILED
16/09/2004 16:19:52: Regression test on SimpleRef.cpp: RUN SUCCESS
16/09/2004 16:20:04: Regression test on SimpleTypeArray.cpp: RUN FAILED
16/09/2004 16:20:18: Regression test on SimpleTypeInnerUnbounded.cpp: RUN FAILED
16/09/2004 16:20:30: Regression test on SimpleTypeInnerUnboundedInOutput.cpp: RUN FAILED
16/09/2004 16:21:21: Regression test on inquire_v2.cpp: BUILD FAILED

Mime
View raw message