axis-c-dev mailing list archives

Site index · List index
Message view « Date » · « Thread »
Top « Date » · « Thread »
From damitha kumarage <dami...@opensource.lk>
Subject Please ignore: this is a test
Date Wed, 08 Sep 2004 07:52:16 GMT
08/09/2004 13:31:21: Regression test on AxisBench.cpp: FAILED
08/09/2004 13:31:33: Regression test on Calculator.cpp: SUCCESS
08/09/2004 13:31:46: Regression test on ComplexTypeAll.cpp: FAILED
08/09/2004 13:31:59: Regression test on Enumeration.cpp: FAILED
08/09/2004 13:32:14: Regression test on ExceptionTest.cpp: SUCCESS
08/09/2004 13:32:29: Regression test on ExtensibilityQuery.cpp: FAILED
08/09/2004 13:32:43: Regression test on FaultMapping.cpp: SUCCESS
08/09/2004 13:32:59: Regression test on InteropTestRound1.cpp: SUCCESS
08/09/2004 13:33:12: Regression test on LargeReturningString.cpp: FAILED
08/09/2004 13:33:24: Regression test on ManyTypeRefRoot.cpp: FAILED
08/09/2004 13:33:37: Regression test on MathOps.cpp: FAILED
08/09/2004 13:33:50: Regression test on RecurseTypes.cpp: FAILED
08/09/2004 13:34:03: Regression test on RpcHttpHeaderTest1.cpp: SUCCESS
08/09/2004 13:34:17: Regression test on RpcHttpHeaderTest2.cpp: SUCCESS
08/09/2004 13:34:31: Regression test on RpcHttpHeaderTest3.cpp: SUCCESS
08/09/2004 13:34:46: Regression test on RpcHttpHeaderTest4.cpp: SUCCESS
08/09/2004 13:34:57: Regression test on RpcHttpHeaderTest5.cpp: BUILD FAILED
08/09/2004 13:35:13: Regression test on RpcHttpHeaderTest7.cpp: SUCCESS
08/09/2004 13:35:28: Regression test on RpcHttpHeaderTest8.cpp: SUCCESS
08/09/2004 13:35:42: Regression test on RpcSoapHeaderTest1.cpp: SUCCESS
08/09/2004 13:35:56: Regression test on RpcSoapHeaderTest10.cpp: SUCCESS
08/09/2004 13:36:10: Regression test on RpcSoapHeaderTest2.cpp: SUCCESS
08/09/2004 13:36:24: Regression test on RpcSoapHeaderTest3.cpp: SUCCESS
08/09/2004 13:36:37: Regression test on RpcSoapHeaderTest4.cpp: SUCCESS
08/09/2004 13:36:53: Regression test on RpcSoapHeaderTest6.cpp: SUCCESS
08/09/2004 13:37:08: Regression test on RpcSoapHeaderTest8.cpp: SUCCESS
08/09/2004 13:37:22: Regression test on RpcSoapHeaderTest9.cpp: SUCCESS
08/09/2004 13:37:35: Regression test on SimpleArray.cpp: SUCCESS
08/09/2004 13:37:38: Regression test on SimpleRef.cpp: BUILD FAILED
08/09/2004 13:37:54: Regression test on SimpleTypeArray.cpp: BUILD FAILED
08/09/2004 13:38:08: Regression test on SimpleTypeInnerUnbounded.cpp: FAILED
08/09/2004 13:38:22: Regression test on SimpleTypeInnerUnboundedInOutput.cpp: FAILED
08/09/2004 13:39:16: Regression test on inquire_v2.cpp: BUILD FAILED
08/09/2004 13:39:32: Regression test on AxisBench.cpp: FAILED
08/09/2004 13:39:45: Regression test on Calculator.cpp: FAILED
08/09/2004 13:39:58: Regression test on ComplexTypeAll.cpp: FAILED
08/09/2004 13:40:09: Regression test on Enumeration.cpp: BUILD FAILED
08/09/2004 13:40:23: Regression test on ExceptionTest.cpp: SUCCESS
08/09/2004 13:40:37: Regression test on ExtensibilityQuery.cpp: FAILED
08/09/2004 13:40:52: Regression test on FaultMapping.cpp: SUCCESS
08/09/2004 13:41:08: Regression test on InteropTestRound1.cpp: SUCCESS
08/09/2004 13:41:22: Regression test on LargeReturningString.cpp: FAILED
08/09/2004 13:41:35: Regression test on ManyTypeRefRoot.cpp: FAILED
08/09/2004 13:41:48: Regression test on MathOps.cpp: FAILED
08/09/2004 13:42:00: Regression test on RecurseTypes.cpp: BUILD FAILED
08/09/2004 13:42:14: Regression test on RpcHttpHeaderTest1.cpp: SUCCESS
08/09/2004 13:42:27: Regression test on RpcHttpHeaderTest2.cpp: SUCCESS
08/09/2004 13:42:36: Regression test on RpcHttpHeaderTest3.cpp: BUILD FAILED
08/09/2004 13:42:48: Regression test on RpcHttpHeaderTest4.cpp: SUCCESS
08/09/2004 13:43:01: Regression test on RpcHttpHeaderTest5.cpp: SUCCESS
08/09/2004 13:43:14: Regression test on RpcHttpHeaderTest7.cpp: SUCCESS
08/09/2004 13:43:28: Regression test on RpcHttpHeaderTest8.cpp: SUCCESS
08/09/2004 13:43:41: Regression test on RpcSoapHeaderTest1.cpp: SUCCESS
08/09/2004 13:43:47: Regression test on RpcSoapHeaderTest10.cpp: BUILD FAILED
08/09/2004 13:44:00: Regression test on RpcSoapHeaderTest2.cpp: SUCCESS
08/09/2004 13:44:14: Regression test on RpcSoapHeaderTest3.cpp: SUCCESS
08/09/2004 13:44:22: Regression test on RpcSoapHeaderTest4.cpp: BUILD FAILED
08/09/2004 13:44:35: Regression test on RpcSoapHeaderTest6.cpp: SUCCESS
08/09/2004 13:44:49: Regression test on RpcSoapHeaderTest8.cpp: SUCCESS
08/09/2004 13:45:02: Regression test on RpcSoapHeaderTest9.cpp: SUCCESS
08/09/2004 13:45:15: Regression test on SimpleArray.cpp: SUCCESS
08/09/2004 13:45:28: Regression test on SimpleRef.cpp: SUCCESS
08/09/2004 13:45:41: Regression test on SimpleTypeArray.cpp: FAILED
08/09/2004 13:45:54: Regression test on SimpleTypeInnerUnbounded.cpp: FAILED
08/09/2004 13:46:07: Regression test on SimpleTypeInnerUnboundedInOutput.cpp: FAILED
08/09/2004 13:50:15: Regression test on inquire_v2.cpp: FAILED

Mime
View raw message