axis-c-dev mailing list archives

Site index · List index
Message view « Date » · « Thread »
Top « Date » · « Thread »
From damitha kumarage <dami...@opensource.lk>
Subject Re: [test-results]Axis C++ Autobuild and regression test
Date Thu, 30 Sep 2004 04:06:41 GMT
Hi,

Don't worry about the RUN FAILED results. I don't have the service of
those clients implemented in my server. It just build those samples but
the logic of these services are not implemented. That's why they result
in RUN FAILED.

FYI:
RUN FAILED means service and client builds, but running the client
against the service failed
BUILD FAILED means either service or client built is failed

thanks
damitha

On Wed, 2004-09-29 at 18:01, damitha kumarage wrote:
> 27/09/2004 18:43:46: Regression test on AxisBench.cpp_client: RUN FAILED
> 27/09/2004 18:44:48: Regression test on Calculator.cpp_client: RUN FAILED
> 27/09/2004 18:45:56: Regression test on ComplexTypeAll.cpp_client: RUN FAILED
> 27/09/2004 18:47:08: Regression test on Enumeration.cpp_client: RUN FAILED
> 27/09/2004 18:48:07: Regression test on ExceptionTest.cpp_client: RUN SUCCESS
> 27/09/2004 18:49:11: Regression test on ExtensibilityQuery.cpp_client: RUN FAILED
> 27/09/2004 18:50:12: Regression test on FaultMapping.cpp_client: RUN SUCCESS
> 27/09/2004 18:53:58: Regression test on inquire_v2.cpp_client: RUN FAILED
> 27/09/2004 18:55:10: Regression test on InteropTestRound1.cpp_client: RUN SUCCESS
> 27/09/2004 18:56:08: Regression test on LargeReturningString.cpp_client: BUILD FAILED
> 27/09/2004 18:57:03: Regression test on ManyTypeRefRoot.cpp_client: RUN FAILED
> 27/09/2004 18:57:59: Regression test on MathOps.cpp_client: RUN FAILED
> 27/09/2004 18:59:07: Regression test on RecurseTypes.cpp_client: RUN FAILED
> 27/09/2004 19:00:16: Regression test on RpcHttpHeaderTest1.cpp_client: RUN SUCCESS
> 27/09/2004 19:01:25: Regression test on RpcHttpHeaderTest2.cpp_client: RUN SUCCESS
> 27/09/2004 19:02:33: Regression test on RpcHttpHeaderTest3.cpp_client: RUN SUCCESS
> 27/09/2004 19:03:41: Regression test on RpcHttpHeaderTest4.cpp_client: RUN SUCCESS
> 27/09/2004 19:04:49: Regression test on RpcHttpHeaderTest5.cpp_client: RUN SUCCESS
> 27/09/2004 19:05:57: Regression test on RpcHttpHeaderTest7.cpp_client: RUN SUCCESS
> 27/09/2004 19:07:05: Regression test on RpcHttpHeaderTest8.cpp_client: RUN SUCCESS
> 27/09/2004 19:08:13: Regression test on RpcSoapHeaderTest10.cpp_client: RUN SUCCESS
> 27/09/2004 19:09:21: Regression test on RpcSoapHeaderTest1.cpp_client: RUN SUCCESS
> 27/09/2004 19:10:30: Regression test on RpcSoapHeaderTest2.cpp_client: RUN SUCCESS
> 27/09/2004 19:11:38: Regression test on RpcSoapHeaderTest3.cpp_client: RUN SUCCESS
> 27/09/2004 19:12:46: Regression test on RpcSoapHeaderTest4.cpp_client: RUN SUCCESS
> 27/09/2004 19:13:54: Regression test on RpcSoapHeaderTest6.cpp_client: RUN SUCCESS
> 27/09/2004 19:15:02: Regression test on RpcSoapHeaderTest8.cpp_client: RUN SUCCESS
> 27/09/2004 19:16:10: Regression test on RpcSoapHeaderTest9.cpp_client: RUN SUCCESS
> 27/09/2004 19:17:15: Regression test on SimpleArray.cpp_client: RUN SUCCESS
> 27/09/2004 19:18:19: Regression test on SimpleRef.cpp_client: RUN SUCCESS
> 27/09/2004 19:19:25: Regression test on SimpleTypeArray.cpp_client: RUN FAILED
> 27/09/2004 19:20:31: Regression test on SimpleTypeInnerUnboundedInOutput.cpp_client:
RUN FAILED
> 27/09/2004 19:21:43: Regression test on SimpleTypeInnerUnbounded.cpp_client: RUN FAILED
> 27/09/2004 19:22:55: Regression test on AxisBench.cpp_client: RUN FAILED
> 27/09/2004 19:23:56: Regression test on Calculator.cpp_client: RUN FAILED
> 27/09/2004 19:25:02: Regression test on ComplexTypeAll.cpp_client: RUN FAILED
> 27/09/2004 19:26:17: Regression test on Enumeration.cpp_client: RUN FAILED
> 27/09/2004 19:27:16: Regression test on ExceptionTest.cpp_client: RUN SUCCESS
> 27/09/2004 19:28:20: Regression test on ExtensibilityQuery.cpp_client: RUN FAILED
> 27/09/2004 19:29:19: Regression test on FaultMapping.cpp_client: RUN SUCCESS
> 27/09/2004 19:33:05: Regression test on inquire_v2.cpp_client: RUN FAILED
> 27/09/2004 19:34:15: Regression test on InteropTestRound1.cpp_client: RUN SUCCESS
> 27/09/2004 19:35:14: Regression test on LargeReturningString.cpp_client: BUILD FAILED
> 27/09/2004 19:36:08: Regression test on ManyTypeRefRoot.cpp_client: RUN FAILED
> 27/09/2004 19:37:04: Regression test on MathOps.cpp_client: RUN FAILED
> 27/09/2004 19:38:12: Regression test on RecurseTypes.cpp_client: RUN FAILED
> 27/09/2004 19:39:20: Regression test on RpcHttpHeaderTest1.cpp_client: RUN SUCCESS
> 27/09/2004 19:40:28: Regression test on RpcHttpHeaderTest2.cpp_client: RUN SUCCESS
> 27/09/2004 19:41:36: Regression test on RpcHttpHeaderTest3.cpp_client: RUN SUCCESS
> 27/09/2004 19:42:44: Regression test on RpcHttpHeaderTest4.cpp_client: RUN SUCCESS
> 27/09/2004 19:43:51: Regression test on RpcHttpHeaderTest5.cpp_client: RUN SUCCESS
> 27/09/2004 19:44:59: Regression test on RpcHttpHeaderTest7.cpp_client: RUN SUCCESS
> 27/09/2004 19:46:08: Regression test on RpcHttpHeaderTest8.cpp_client: RUN SUCCESS
> 27/09/2004 19:47:15: Regression test on RpcSoapHeaderTest10.cpp_client: RUN SUCCESS
> 27/09/2004 19:48:23: Regression test on RpcSoapHeaderTest1.cpp_client: RUN SUCCESS
> 27/09/2004 19:49:31: Regression test on RpcSoapHeaderTest2.cpp_client: RUN SUCCESS
> 27/09/2004 19:50:39: Regression test on RpcSoapHeaderTest3.cpp_client: RUN SUCCESS
> 27/09/2004 19:51:47: Regression test on RpcSoapHeaderTest4.cpp_client: RUN SUCCESS
> 27/09/2004 19:52:54: Regression test on RpcSoapHeaderTest6.cpp_client: RUN SUCCESS
> 27/09/2004 19:54:02: Regression test on RpcSoapHeaderTest8.cpp_client: RUN SUCCESS
> 27/09/2004 19:55:10: Regression test on RpcSoapHeaderTest9.cpp_client: RUN SUCCESS
> 27/09/2004 19:56:15: Regression test on SimpleArray.cpp_client: RUN SUCCESS
> 27/09/2004 19:57:19: Regression test on SimpleRef.cpp_client: RUN SUCCESS
> 27/09/2004 19:58:25: Regression test on SimpleTypeArray.cpp_client: RUN FAILED
> 27/09/2004 19:59:30: Regression test on SimpleTypeInnerUnboundedInOutput.cpp_client:
RUN FAILED
> 27/09/2004 20:00:42: Regression test on SimpleTypeInnerUnbounded.cpp_client: RUN FAILED
> 


Mime
View raw message