avro-dev mailing list archives

Site index · List index
Message view « Date » · « Thread »
Top « Date » · « Thread »
From Apache Jenkins Server <jenk...@builds.apache.org>
Subject Build failed in Jenkins: AVRO-python #587
Date Tue, 12 Jan 2016 11:29:30 GMT
See <https://builds.apache.org/job/AVRO-python/587/changes>

Changes:

[tomwhite] AVRO-1779. Avro docs convenience artifact missing LICENSE/NOTICE. Contributed by
blue.

------------------------------------------
[...truncated 2025 lines...]
A         lang/c/jansson/configure.ac
A         lang/c/jansson/README.rst
A         lang/c/NEWS
A         lang/c/CMakeLists.txt
A         lang/c/examples
A         lang/c/examples/CMakeLists.txt
A         lang/c/examples/quickstop.c
A         lang/c/examples/.gitignore
A         lang/c/NOTICE
A         lang/c/LICENSE
A         lang/c/AUTHORS
A         lang/c/CPackConfig.txt
A         lang/c/ChangeLog
A         lang/c/src
A         lang/c/src/avroappend.c
A         lang/c/src/avrocat.c
A         lang/c/src/schema.c
A         lang/c/src/datum_equal.c
A         lang/c/src/resolver.c
A         lang/c/src/datum_size.c
A         lang/c/src/memoize.c
A         lang/c/src/schema.h
A         lang/c/src/schema_specific.c
A         lang/c/src/datum_value.c
A         lang/c/src/string.c
A         lang/c/src/avromod.c
A         lang/c/src/io.c
A         lang/c/src/wrapped-buffer.c
A         lang/c/src/datafile.c
A         lang/c/src/value-sizeof.c
A         lang/c/src/generic.c
A         lang/c/src/avro-c.pc.in
A         lang/c/src/errors.c
A         lang/c/src/codec.c
A         lang/c/src/array.c
A         lang/c/src/codec.h
A         lang/c/src/value-json.c
A         lang/c/src/resolved-reader.c
A         lang/c/src/datum_write.c
A         lang/c/src/avropipe.c
A         lang/c/src/allocation.c
A         lang/c/src/st.c
A         lang/c/src/avro
A         lang/c/src/avro/consumer.h
A         lang/c/src/avro/errors.h
A         lang/c/src/avro/generic.h
A         lang/c/src/avro/value.h
A         lang/c/src/avro/msinttypes.h
A         lang/c/src/avro/schema.h
A         lang/c/src/avro/resolver.h
A         lang/c/src/avro/basics.h
A         lang/c/src/avro/legacy.h
A         lang/c/src/avro/platform.h
A         lang/c/src/avro/allocation.h
A         lang/c/src/avro/msstdint.h
A         lang/c/src/avro/refcount.h
A         lang/c/src/avro/io.h
A         lang/c/src/avro/data.h
A         lang/c/src/schema_equal.c
A         lang/c/src/encoding_binary.c
A         lang/c/src/encoding.h
A         lang/c/src/consumer.c
A         lang/c/src/consume-binary.c
A         lang/c/src/st.h
A         lang/c/src/CMakeLists.txt
A         lang/c/src/resolved-writer.c
A         lang/c/src/datum_skip.c
A         lang/c/src/avro_generic_internal.h
A         lang/c/src/value-write.c
A         lang/c/src/dump.c
A         lang/c/src/datum_read.c
A         lang/c/src/avro_private.h
A         lang/c/src/dump.h
A         lang/c/src/datum.c
A         lang/c/src/avro.h
A         lang/c/src/value.c
A         lang/c/src/map.c
A         lang/c/src/datum.h
A         lang/c/src/datum_validate.c
A         lang/c/src/.gitignore
A         lang/c/src/value-read.c
A         lang/c/src/value-hash.c
A         lang/c/docs
A         lang/c/docs/index.txt
A         lang/c/docs/CMakeLists.txt
A         lang/c/README.maintaining_win32.txt
A         lang/c/FindSnappy.cmake
A         lang/c/README
AU        lang/c/version.sh
A         lang/perl
A         lang/perl/t
A         lang/perl/t/01_schema.t
A         lang/perl/t/01_names.t
A         lang/perl/t/05_protocol.t
A         lang/perl/t/02_bin_encode.t
A         lang/perl/t/00_compile.t
A         lang/perl/t/04_datafile.t
A         lang/perl/t/03_bin_decode.t
A         lang/perl/.gitignore
A         lang/perl/MANIFEST
A         lang/perl/lib
AU        lang/perl/lib/Avro.pm
A         lang/perl/lib/Avro
AU        lang/perl/lib/Avro/DataFile.pm
AU        lang/perl/lib/Avro/BinaryDecoder.pm
AU        lang/perl/lib/Avro/DataFileReader.pm
AU        lang/perl/lib/Avro/Schema.pm
AU        lang/perl/lib/Avro/Protocol.pm
AU        lang/perl/lib/Avro/BinaryEncoder.pm
AU        lang/perl/lib/Avro/DataFileWriter.pm
A         lang/perl/lib/Avro/Protocol
AU        lang/perl/lib/Avro/Protocol/Message.pm
AU        lang/perl/Makefile.PL
A         lang/perl/Changes
A         lang/perl/bin
A         lang/perl/bin/avro-to-json
A         lang/perl/MANIFEST.SKIP
A         lang/perl/xt
A         lang/perl/xt/pod.t
AU        lang/perl/README
A         lang/perl/.shipit
A         lang/perl/NOTICE
A         lang/perl/LICENSE
A         share
A         share/docker
A         share/docker/Dockerfile
A         share/editors
A         share/editors/avro-idl.vim
A         share/editors/README.txt
A         share/test
A         share/test/interop
A         share/test/interop/rpc
A         share/test/interop/rpc/echo
A         share/test/interop/rpc/echo/foo
AU        share/test/interop/rpc/echo/foo/response.avro
AU        share/test/interop/rpc/echo/foo/request.avro
A         share/test/interop/rpc/hello
A         share/test/interop/rpc/hello/world
AU        share/test/interop/rpc/hello/world/request.avro
AU        share/test/interop/rpc/hello/world/response.avro
A         share/test/interop/rpc/add
A         share/test/interop/rpc/add/onePlusOne
AU        share/test/interop/rpc/add/onePlusOne/request.avro
AU        share/test/interop/rpc/add/onePlusOne/response.avro
A         share/test/interop/bin
AU        share/test/interop/bin/test_rpc_interop.sh
A         share/test/schemas
A         share/test/schemas/contexts.avdl
A         share/test/schemas/BulkData.avpr
A         share/test/schemas/social.avdl
A         share/test/schemas/simple.avpr
A         share/test/schemas/stringables.avdl
A         share/test/schemas/echo.avdl
A         share/test/schemas/namespace.avpr
A         share/test/schemas/http.avdl
A         share/test/schemas/FooBarSpecificRecord.avsc
A         share/test/schemas/mail.avpr
A         share/test/schemas/reserved.avsc
A         share/test/schemas/specialtypes.avdl
A         share/test/schemas/weather.avsc
A         share/test/schemas/interop.avsc
A         share/test/data
A         share/test/data/weather.json
AU        share/test/data/test.avro12
AU        share/test/data/weather-snappy.avro
AU        share/test/data/schema-tests.txt
AU        share/test/data/syncInMeta.avro
AU        share/test/data/weather-sorted.avro
AU        share/test/data/weather.avro
A         share/VERSION.txt
A         share/schemas
A         share/schemas/org
A         share/schemas/org/apache
A         share/schemas/org/apache/avro
A         share/schemas/org/apache/avro/mapred
A         share/schemas/org/apache/avro/mapred/tether
A         share/schemas/org/apache/avro/mapred/tether/InputProtocol.avpr
A         share/schemas/org/apache/avro/mapred/tether/OutputProtocol.avpr
A         share/schemas/org/apache/avro/data
A         share/schemas/org/apache/avro/data/Json.avsc
A         share/schemas/org/apache/avro/ipc
A         share/schemas/org/apache/avro/ipc/HandshakeRequest.avsc
A         share/schemas/org/apache/avro/ipc/HandshakeResponse.avsc
 U        .
At revision 1724208
[py] $ /home/jenkins/tools/ant/latest/bin/ant -file build.xml test
Buildfile: <https://builds.apache.org/job/AVRO-python/ws/trunk/lang/py/build.xml>

init:
    [mkdir] Created dir: <https://builds.apache.org/job/AVRO-python/ws/trunk/lang/py/build>

ivy-download:
      [get] Getting: http://repo2.maven.org/maven2/org/apache/ivy/ivy/2.2.0/ivy-2.2.0.jar
      [get] To: <https://builds.apache.org/job/AVRO-python/ws/trunk/lang/py/lib/ivy-2.2.0.jar>

build:
     [copy] Copying 14 files to <https://builds.apache.org/job/AVRO-python/ws/trunk/lang/py/build/src>
     [copy] Copying 19 files to <https://builds.apache.org/job/AVRO-python/ws/trunk/lang/py/build/test>
     [copy] Copying 10 files to <https://builds.apache.org/job/AVRO-python/ws/trunk/lang/py/build/lib>
     [copy] Copying 2 files to <https://builds.apache.org/job/AVRO-python/ws/trunk/lang/py/build/src/avro/tether>
     [copy] Copying 1 file to <https://builds.apache.org/job/AVRO-python/ws/trunk/lang/py/build/src/avro>
     [copy] Copying 1 file to <https://builds.apache.org/job/AVRO-python/ws/trunk/lang/py/build>
     [copy] Copying 1 file to <https://builds.apache.org/job/AVRO-python/ws/trunk/lang/py/build/scripts>
     [copy] Copying 1 file to <https://builds.apache.org/job/AVRO-python/ws/trunk/lang/py/build/test>
[ivy:retrieve] :: Ivy 2.2.0 - 20100923230623 :: http://ant.apache.org/ivy/ ::
[ivy:retrieve] :: loading settings :: file = <https://builds.apache.org/job/AVRO-python/ws/trunk/lang/py/ivysettings.xml>
[ivy:retrieve] :: resolving dependencies :: org.apache.avro#python;working@priapus.apache.org
[ivy:retrieve] 	confs: [default]
[ivy:retrieve] :: resolution report :: resolve 1248ms :: artifacts dl 0ms
	---------------------------------------------------------------------
	|                  |            modules            ||   artifacts   |
	|       conf       | number| search|dwnlded|evicted|| number|dwnlded|
	---------------------------------------------------------------------
	|      default     |   1   |   0   |   0   |   0   ||   0   |   0   |
	---------------------------------------------------------------------
[ivy:retrieve] 
[ivy:retrieve] :: problems summary ::
[ivy:retrieve] :::: WARNINGS
[ivy:retrieve] 		module not found: org.apache.avro#avro-tools;1.9.0-SNAPSHOT
[ivy:retrieve] 	==== central: tried
[ivy:retrieve] 	  http://repo1.maven.org/maven2/org/apache/avro/avro-tools/1.9.0-SNAPSHOT/avro-tools-1.9.0-SNAPSHOT.pom
[ivy:retrieve] 	  -- artifact org.apache.avro#avro-tools;1.9.0-SNAPSHOT!avro-tools.jar:
[ivy:retrieve] 	  http://repo1.maven.org/maven2/org/apache/avro/avro-tools/1.9.0-SNAPSHOT/avro-tools-1.9.0-SNAPSHOT.jar
[ivy:retrieve] 	==== apache-snapshots: tried
[ivy:retrieve] 	  https://repository.apache.org/content/groups/snapshots/org/apache/avro/avro-tools/1.9.0-SNAPSHOT/avro-tools-1.9.0-SNAPSHOT.pom
[ivy:retrieve] 	  -- artifact org.apache.avro#avro-tools;1.9.0-SNAPSHOT!avro-tools.jar:
[ivy:retrieve] 	  https://repository.apache.org/content/groups/snapshots/org/apache/avro/avro-tools/1.9.0-SNAPSHOT/avro-tools-1.9.0-SNAPSHOT.jar
[ivy:retrieve] 	==== local-maven2: tried
[ivy:retrieve] 	  /home/jenkins/.m2/repository/org/apache/avro/avro-tools/1.9.0-SNAPSHOT/avro-tools-1.9.0-SNAPSHOT.xml
[ivy:retrieve] 	  -- artifact org.apache.avro#avro-tools;1.9.0-SNAPSHOT!avro-tools.jar:
[ivy:retrieve] 	  /home/jenkins/.m2/repository/org/apache/avro/avro-tools/1.9.0-SNAPSHOT/avro-tools-1.9.0-SNAPSHOT.jar
[ivy:retrieve] 		::::::::::::::::::::::::::::::::::::::::::::::
[ivy:retrieve] 		::          UNRESOLVED DEPENDENCIES         ::
[ivy:retrieve] 		::::::::::::::::::::::::::::::::::::::::::::::
[ivy:retrieve] 		:: org.apache.avro#avro-tools;1.9.0-SNAPSHOT: not found
[ivy:retrieve] 		::::::::::::::::::::::::::::::::::::::::::::::
[ivy:retrieve] :::: ERRORS
[ivy:retrieve] 	Server access Error: java.lang.RuntimeException: Could not generate DH keypair
url=https://repository.apache.org/content/groups/snapshots/org/apache/avro/avro-tools/1.9.0-SNAPSHOT/maven-metadata.xml
[ivy:retrieve] 	Server access Error: java.lang.RuntimeException: Could not generate DH keypair
url=https://repository.apache.org/content/groups/snapshots/org/apache/avro/avro-tools/1.9.0-SNAPSHOT/avro-tools-1.9.0-SNAPSHOT.pom
[ivy:retrieve] 	Server access Error: java.lang.RuntimeException: Could not generate DH keypair
url=https://repository.apache.org/content/groups/snapshots/org/apache/avro/avro-tools/1.9.0-SNAPSHOT/avro-tools-1.9.0-SNAPSHOT.jar
[ivy:retrieve] 
[ivy:retrieve] :: USE VERBOSE OR DEBUG MESSAGE LEVEL FOR MORE DETAILS

BUILD FAILED
<https://builds.apache.org/job/AVRO-python/ws/trunk/lang/py/build.xml>:146: impossible
to resolve dependencies:
	resolve failed - see output for details

Total time: 2 seconds
Build step 'Invoke Ant' marked build as failure

Mime
View raw message