avro-dev mailing list archives

Site index · List index
Message view « Date » · « Thread »
Top « Date » · « Thread »
From Apache Jenkins Server <jenk...@builds.apache.org>
Subject Build failed in Jenkins: AVRO-python #583
Date Wed, 16 Dec 2015 00:45:31 GMT
See <https://builds.apache.org/job/AVRO-python/583/changes>

Changes:

[blue] Preparing for 1.9.0 development.

[blue] Preparing for release 1.8.0.

------------------------------------------
[...truncated 2022 lines...]
A         lang/py/src/avro/io.py
A         lang/py/src/avro/txipc.py
A         lang/py/src/avro/datafile.py
A         lang/py/src/avro/NOTICE
A         lang/py/src/avro/LICENSE
A         lang/py/src/avro/ipc.py
A         lang/py/src/avro/tool.py
A         lang/py/src/avro/__init__.py
A         lang/py/src/avro/schema.py
A         lang/py/src/avro/protocol.py
A         lang/py3
A         lang/py3/avro
AU        lang/py3/avro/tool.py
AU        lang/py3/avro/__init__.py
AU        lang/py3/avro/schema.py
AU        lang/py3/avro/protocol.py
AU        lang/py3/avro/io.py
AU        lang/py3/avro/txipc.py
AU        lang/py3/avro/datafile.py
A         lang/py3/avro/NOTICE
A         lang/py3/avro/LICENSE
AU        lang/py3/avro/ipc.py
A         lang/py3/avro/tests
AU        lang/py3/avro/tests/gen_interop_data.py
AU        lang/py3/avro/tests/txsample_http_server.py
A         lang/py3/avro/tests/test_enum.py
AU        lang/py3/avro/tests/test_script.py
AU        lang/py3/avro/tests/av_bench.py
AU        lang/py3/avro/tests/run_tests.py
AU        lang/py3/avro/tests/sample_http_server.py
AU        lang/py3/avro/tests/test_io.py
AU        lang/py3/avro/tests/test_datafile.py
AU        lang/py3/avro/tests/test_datafile_interop.py
AU        lang/py3/avro/tests/test_ipc.py
AU        lang/py3/avro/tests/txsample_http_client.py
AU        lang/py3/avro/tests/sample_http_client.py
AU        lang/py3/avro/tests/test_schema.py
AU        lang/py3/avro/tests/test_protocol.py
A         lang/py3/scripts
A         lang/py3/scripts/avro
AU        lang/py3/setup.py
A         lang/py3/README.txt
A         lang/js
A         lang/js/test
A         lang/js/test/dat
A         lang/js/test/dat/person-10.no-codec.avro
A         lang/js/test/dat/Person.avsc
A         lang/js/test/dat/person-10.avro.raw
A         lang/js/test/dat/Id.avsc
A         lang/js/test/dat/person-10.avro
A         lang/js/test/test_utils.js
A         lang/js/test/test_files.js
A         lang/js/test/test_schemas.js
A         lang/js/NOTICE
A         lang/js/LICENSE
A         lang/js/package.json
A         lang/js/doc
A         lang/js/doc/Advanced-usage.md
A         lang/js/doc/Home.md
A         lang/js/doc/API.md
A         lang/js/lib
A         lang/js/lib/utils.js
A         lang/js/lib/files.js
A         lang/js/lib/schemas.js
A         lang/js/lib/index.js
AU        lang/js/build.sh
A         lang/js/etc
A         lang/js/etc/deprecated
A         lang/js/etc/deprecated/Gruntfile.js
AU        lang/js/etc/deprecated/README
AU        lang/js/etc/deprecated/test_validator.js
AU        lang/js/etc/deprecated/validator.js
A         lang/js/etc/browser
A         lang/js/etc/browser/avro.js
A         lang/js/etc/browser/crypto.js
A         lang/js/README.md
A         share
A         share/VERSION.txt
A         share/schemas
A         share/schemas/org
A         share/schemas/org/apache
A         share/schemas/org/apache/avro
A         share/schemas/org/apache/avro/mapred
A         share/schemas/org/apache/avro/mapred/tether
A         share/schemas/org/apache/avro/mapred/tether/InputProtocol.avpr
A         share/schemas/org/apache/avro/mapred/tether/OutputProtocol.avpr
A         share/schemas/org/apache/avro/data
A         share/schemas/org/apache/avro/data/Json.avsc
A         share/schemas/org/apache/avro/ipc
A         share/schemas/org/apache/avro/ipc/HandshakeResponse.avsc
A         share/schemas/org/apache/avro/ipc/HandshakeRequest.avsc
A         share/docker
A         share/docker/Dockerfile
A         share/editors
A         share/editors/avro-idl.vim
A         share/editors/README.txt
A         share/test
A         share/test/interop
A         share/test/interop/rpc
A         share/test/interop/rpc/echo
A         share/test/interop/rpc/echo/foo
AU        share/test/interop/rpc/echo/foo/request.avro
AU        share/test/interop/rpc/echo/foo/response.avro
A         share/test/interop/rpc/hello
A         share/test/interop/rpc/hello/world
AU        share/test/interop/rpc/hello/world/response.avro
AU        share/test/interop/rpc/hello/world/request.avro
A         share/test/interop/rpc/add
A         share/test/interop/rpc/add/onePlusOne
AU        share/test/interop/rpc/add/onePlusOne/request.avro
AU        share/test/interop/rpc/add/onePlusOne/response.avro
A         share/test/interop/bin
AU        share/test/interop/bin/test_rpc_interop.sh
A         share/test/schemas
A         share/test/schemas/FooBarSpecificRecord.avsc
A         share/test/schemas/mail.avpr
A         share/test/schemas/reserved.avsc
A         share/test/schemas/specialtypes.avdl
A         share/test/schemas/weather.avsc
A         share/test/schemas/interop.avsc
A         share/test/schemas/contexts.avdl
A         share/test/schemas/BulkData.avpr
A         share/test/schemas/social.avdl
A         share/test/schemas/simple.avpr
A         share/test/schemas/stringables.avdl
A         share/test/schemas/echo.avdl
A         share/test/schemas/namespace.avpr
A         share/test/schemas/http.avdl
A         share/test/data
A         share/test/data/weather.json
AU        share/test/data/test.avro12
AU        share/test/data/weather-snappy.avro
AU        share/test/data/schema-tests.txt
AU        share/test/data/syncInMeta.avro
AU        share/test/data/weather-sorted.avro
AU        share/test/data/weather.avro
A         .gitignore
A         doc
A         doc/src
AU        doc/src/cli.xconf
A         doc/src/skinconf.xml
A         doc/src/content
A         doc/src/content/htmldocs
AU        doc/src/content/htmldocs/canonical-completeness.html
A         doc/src/content/xdocs
A         doc/src/content/xdocs/tabs.xml
AU        doc/src/content/xdocs/gettingstartedjava.xml
AU        doc/src/content/xdocs/gettingstartedpython.xml
A         doc/src/content/xdocs/spec.xml
AU        doc/src/content/xdocs/mr.xml
A         doc/src/content/xdocs/sasl.xml
A         doc/src/content/xdocs/site.xml
A         doc/src/content/xdocs/index.xml
A         doc/src/content/xdocs/idl.xml
A         doc/src/resources
A         doc/src/resources/images
A         doc/src/resources/images/favicon.ico
AU        doc/src/resources/images/apache_feather.gif
AU        doc/src/resources/images/avro-logo.png
A         doc/build.xml
A         doc/examples
A         doc/examples/mr-example
A         doc/examples/mr-example/src
A         doc/examples/mr-example/src/main
A         doc/examples/mr-example/src/main/java
A         doc/examples/mr-example/src/main/java/example
AU        doc/examples/mr-example/src/main/java/example/GenerateData.java
AU        doc/examples/mr-example/src/main/java/example/AvroWordCount.java
AU        doc/examples/mr-example/src/main/java/example/MapReduceColorCount.java
AU        doc/examples/mr-example/src/main/java/example/MapredColorCount.java
AU        doc/examples/mr-example/src/main/java/example/MapReduceAvroWordCount.java
AU        doc/examples/mr-example/pom.xml
A         doc/examples/user.avsc
A         doc/examples/java-example
A         doc/examples/java-example/src
A         doc/examples/java-example/src/main
A         doc/examples/java-example/src/main/java
A         doc/examples/java-example/src/main/java/example
AU        doc/examples/java-example/src/main/java/example/GenericMain.java
AU        doc/examples/java-example/src/main/java/example/SpecificMain.java
AU        doc/examples/java-example/pom.xml
AU        doc/examples/example.py
A         doc/forrest.properties
 U        .
At revision 1720287
[py] $ /home/jenkins/tools/ant/latest/bin/ant -file build.xml test
Buildfile: <https://builds.apache.org/job/AVRO-python/ws/trunk/lang/py/build.xml>

init:
    [mkdir] Created dir: <https://builds.apache.org/job/AVRO-python/ws/trunk/lang/py/build>

ivy-download:
      [get] Getting: http://repo2.maven.org/maven2/org/apache/ivy/ivy/2.2.0/ivy-2.2.0.jar
      [get] To: <https://builds.apache.org/job/AVRO-python/ws/trunk/lang/py/lib/ivy-2.2.0.jar>

build:
     [copy] Copying 14 files to <https://builds.apache.org/job/AVRO-python/ws/trunk/lang/py/build/src>
     [copy] Copying 19 files to <https://builds.apache.org/job/AVRO-python/ws/trunk/lang/py/build/test>
     [copy] Copying 10 files to <https://builds.apache.org/job/AVRO-python/ws/trunk/lang/py/build/lib>
     [copy] Copying 2 files to <https://builds.apache.org/job/AVRO-python/ws/trunk/lang/py/build/src/avro/tether>
     [copy] Copying 1 file to <https://builds.apache.org/job/AVRO-python/ws/trunk/lang/py/build/src/avro>
     [copy] Copying 1 file to <https://builds.apache.org/job/AVRO-python/ws/trunk/lang/py/build>
     [copy] Copying 1 file to <https://builds.apache.org/job/AVRO-python/ws/trunk/lang/py/build/scripts>
     [copy] Copying 1 file to <https://builds.apache.org/job/AVRO-python/ws/trunk/lang/py/build/test>
[ivy:retrieve] :: Ivy 2.2.0 - 20100923230623 :: http://ant.apache.org/ivy/ ::
[ivy:retrieve] :: loading settings :: file = <https://builds.apache.org/job/AVRO-python/ws/trunk/lang/py/ivysettings.xml>
[ivy:retrieve] :: resolving dependencies :: org.apache.avro#python;working@jenkins-ubuntu-1404-4gb-fc5
[ivy:retrieve] 	confs: [default]
[ivy:retrieve] :: resolution report :: resolve 2365ms :: artifacts dl 0ms
	---------------------------------------------------------------------
	|                  |            modules            ||   artifacts   |
	|       conf       | number| search|dwnlded|evicted|| number|dwnlded|
	---------------------------------------------------------------------
	|      default     |   1   |   0   |   0   |   0   ||   0   |   0   |
	---------------------------------------------------------------------
[ivy:retrieve] 
[ivy:retrieve] :: problems summary ::
[ivy:retrieve] :::: WARNINGS
[ivy:retrieve] 		module not found: org.apache.avro#avro-tools;1.9.0-SNAPSHOT
[ivy:retrieve] 	==== central: tried
[ivy:retrieve] 	  http://repo1.maven.org/maven2/org/apache/avro/avro-tools/1.9.0-SNAPSHOT/avro-tools-1.9.0-SNAPSHOT.pom
[ivy:retrieve] 	  -- artifact org.apache.avro#avro-tools;1.9.0-SNAPSHOT!avro-tools.jar:
[ivy:retrieve] 	  http://repo1.maven.org/maven2/org/apache/avro/avro-tools/1.9.0-SNAPSHOT/avro-tools-1.9.0-SNAPSHOT.jar
[ivy:retrieve] 	==== apache-snapshots: tried
[ivy:retrieve] 	  https://repository.apache.org/content/groups/snapshots/org/apache/avro/avro-tools/1.9.0-SNAPSHOT/avro-tools-1.9.0-SNAPSHOT.pom
[ivy:retrieve] 	  -- artifact org.apache.avro#avro-tools;1.9.0-SNAPSHOT!avro-tools.jar:
[ivy:retrieve] 	  https://repository.apache.org/content/groups/snapshots/org/apache/avro/avro-tools/1.9.0-SNAPSHOT/avro-tools-1.9.0-SNAPSHOT.jar
[ivy:retrieve] 	==== local-maven2: tried
[ivy:retrieve] 	  /home/jenkins/.m2/repository/org/apache/avro/avro-tools/1.9.0-SNAPSHOT/avro-tools-1.9.0-SNAPSHOT.xml
[ivy:retrieve] 	  -- artifact org.apache.avro#avro-tools;1.9.0-SNAPSHOT!avro-tools.jar:
[ivy:retrieve] 	  /home/jenkins/.m2/repository/org/apache/avro/avro-tools/1.9.0-SNAPSHOT/avro-tools-1.9.0-SNAPSHOT.jar
[ivy:retrieve] 		::::::::::::::::::::::::::::::::::::::::::::::
[ivy:retrieve] 		::          UNRESOLVED DEPENDENCIES         ::
[ivy:retrieve] 		::::::::::::::::::::::::::::::::::::::::::::::
[ivy:retrieve] 		:: org.apache.avro#avro-tools;1.9.0-SNAPSHOT: not found
[ivy:retrieve] 		::::::::::::::::::::::::::::::::::::::::::::::
[ivy:retrieve] :::: ERRORS
[ivy:retrieve] 	Server access Error: java.lang.RuntimeException: Could not generate DH keypair
url=https://repository.apache.org/content/groups/snapshots/org/apache/avro/avro-tools/1.9.0-SNAPSHOT/maven-metadata.xml
[ivy:retrieve] 	Server access Error: java.lang.RuntimeException: Could not generate DH keypair
url=https://repository.apache.org/content/groups/snapshots/org/apache/avro/avro-tools/1.9.0-SNAPSHOT/avro-tools-1.9.0-SNAPSHOT.pom
[ivy:retrieve] 	Server access Error: java.lang.RuntimeException: Could not generate DH keypair
url=https://repository.apache.org/content/groups/snapshots/org/apache/avro/avro-tools/1.9.0-SNAPSHOT/avro-tools-1.9.0-SNAPSHOT.jar
[ivy:retrieve] 
[ivy:retrieve] :: USE VERBOSE OR DEBUG MESSAGE LEVEL FOR MORE DETAILS

BUILD FAILED
<https://builds.apache.org/job/AVRO-python/ws/trunk/lang/py/build.xml>:146: impossible
to resolve dependencies:
	resolve failed - see output for details

Total time: 5 seconds
Build step 'Invoke Ant' marked build as failure

Mime
View raw message