avro-dev mailing list archives

Site index · List index
Message view « Date » · « Thread »
Top « Date » · « Thread »
From Apache Jenkins Server <jenk...@builds.apache.org>
Subject Build failed in Jenkins: AVRO-python #561
Date Mon, 10 Aug 2015 14:29:14 GMT
See <https://builds.apache.org/job/AVRO-python/561/changes>

Changes:

[tomwhite] Preparing for 1.9.0 development

------------------------------------------
Started by an SCM change
Building remotely on ubuntu-6 (docker Ubuntu ubuntu) in workspace <https://builds.apache.org/job/AVRO-python/ws/>
Reverting <https://builds.apache.org/job/AVRO-python/ws/trunk> to depth infinity with
ignoreExternals: false
Updating https://svn.apache.org/repos/asf/avro/trunk at revision '2015-08-10T14:29:08.530
+0000'
U         lang/java/maven-plugin/pom.xml
U         lang/java/archetypes/pom.xml
U         lang/java/archetypes/avro-service-archetype/pom.xml
U         lang/java/avro/pom.xml
U         lang/java/trevni/doc/pom.xml
U         lang/java/trevni/avro/pom.xml
U         lang/java/trevni/core/pom.xml
U         lang/java/trevni/pom.xml
U         lang/java/mapred/pom.xml
U         lang/java/compiler/pom.xml
U         lang/java/pom.xml
U         lang/java/ipc/pom.xml
U         lang/java/protobuf/pom.xml
U         lang/java/thrift/pom.xml
U         lang/java/tools/pom.xml
U         share/VERSION.txt
U         CHANGES.txt
U         pom.xml
At revision 1695086
[py] $ /home/jenkins/tools/ant/latest/bin/ant -file build.xml test
Buildfile: <https://builds.apache.org/job/AVRO-python/ws/trunk/lang/py/build.xml>

init:

ivy-download:

build:
     [copy] Copying 1 file to <https://builds.apache.org/job/AVRO-python/ws/trunk/lang/py/build/src/avro>
     [copy] Copying 1 file to <https://builds.apache.org/job/AVRO-python/ws/trunk/lang/py/build>
     [copy] Copying 1 file to <https://builds.apache.org/job/AVRO-python/ws/trunk/lang/py/build/scripts>
     [copy] Copying 1 file to <https://builds.apache.org/job/AVRO-python/ws/trunk/lang/py/build/test>
[ivy:retrieve] :: Ivy 2.2.0 - 20100923230623 :: http://ant.apache.org/ivy/ ::
[ivy:retrieve] :: loading settings :: file = <https://builds.apache.org/job/AVRO-python/ws/trunk/lang/py/ivysettings.xml>
[ivy:retrieve] :: resolving dependencies :: org.apache.avro#python;working@priapus.apache.org
[ivy:retrieve] 	confs: [default]
[ivy:retrieve] :: resolution report :: resolve 1245ms :: artifacts dl 0ms
	---------------------------------------------------------------------
	|                  |            modules            ||   artifacts   |
	|       conf       | number| search|dwnlded|evicted|| number|dwnlded|
	---------------------------------------------------------------------
	|      default     |   1   |   0   |   0   |   0   ||   0   |   0   |
	---------------------------------------------------------------------
[ivy:retrieve] 
[ivy:retrieve] :: problems summary ::
[ivy:retrieve] :::: WARNINGS
[ivy:retrieve] 		module not found: org.apache.avro#avro-tools;1.9.0-SNAPSHOT
[ivy:retrieve] 	==== central: tried
[ivy:retrieve] 	  http://repo1.maven.org/maven2/org/apache/avro/avro-tools/1.9.0-SNAPSHOT/avro-tools-1.9.0-SNAPSHOT.pom
[ivy:retrieve] 	  -- artifact org.apache.avro#avro-tools;1.9.0-SNAPSHOT!avro-tools.jar:
[ivy:retrieve] 	  http://repo1.maven.org/maven2/org/apache/avro/avro-tools/1.9.0-SNAPSHOT/avro-tools-1.9.0-SNAPSHOT.jar
[ivy:retrieve] 	==== apache-snapshots: tried
[ivy:retrieve] 	  https://repository.apache.org/content/groups/snapshots/org/apache/avro/avro-tools/1.9.0-SNAPSHOT/avro-tools-1.9.0-SNAPSHOT.pom
[ivy:retrieve] 	  -- artifact org.apache.avro#avro-tools;1.9.0-SNAPSHOT!avro-tools.jar:
[ivy:retrieve] 	  https://repository.apache.org/content/groups/snapshots/org/apache/avro/avro-tools/1.9.0-SNAPSHOT/avro-tools-1.9.0-SNAPSHOT.jar
[ivy:retrieve] 		::::::::::::::::::::::::::::::::::::::::::::::
[ivy:retrieve] 		::          UNRESOLVED DEPENDENCIES         ::
[ivy:retrieve] 		::::::::::::::::::::::::::::::::::::::::::::::
[ivy:retrieve] 		:: org.apache.avro#avro-tools;1.9.0-SNAPSHOT: not found
[ivy:retrieve] 		::::::::::::::::::::::::::::::::::::::::::::::
[ivy:retrieve] :::: ERRORS
[ivy:retrieve] 	Server access Error: java.lang.RuntimeException: Could not generate DH keypair
url=https://repository.apache.org/content/groups/snapshots/org/apache/avro/avro-tools/1.9.0-SNAPSHOT/maven-metadata.xml
[ivy:retrieve] 	Server access Error: java.lang.RuntimeException: Could not generate DH keypair
url=https://repository.apache.org/content/groups/snapshots/org/apache/avro/avro-tools/1.9.0-SNAPSHOT/avro-tools-1.9.0-SNAPSHOT.pom
[ivy:retrieve] 	Server access Error: java.lang.RuntimeException: Could not generate DH keypair
url=https://repository.apache.org/content/groups/snapshots/org/apache/avro/avro-tools/1.9.0-SNAPSHOT/avro-tools-1.9.0-SNAPSHOT.jar
[ivy:retrieve] 
[ivy:retrieve] :: USE VERBOSE OR DEBUG MESSAGE LEVEL FOR MORE DETAILS

BUILD FAILED
<https://builds.apache.org/job/AVRO-python/ws/trunk/lang/py/build.xml>:146: impossible
to resolve dependencies:
	resolve failed - see output for details

Total time: 2 seconds
Build step 'Invoke Ant' marked build as failure

Mime
View raw message