avro-dev mailing list archives

Site index · List index
Message view « Date » · « Thread »
Top « Date » · « Thread »
From Apache Jenkins Server <jenk...@builds.apache.org>
Subject Build failed in Jenkins: AvroJava #496
Date Sat, 08 Nov 2014 01:33:14 GMT
See <https://builds.apache.org/job/AvroJava/496/changes>

Changes:

[cutting] AVRO-1597. Java: Random data tool writes corrupt files to standard out.

[cutting] AVRO-1592. Java: Fix handling of Java reserved words as enum constants in generated
code.  Contributed by Lukas Steiblys.

------------------------------------------
[...truncated 1121 lines...]
Uploaded: https://repository.apache.org/content/repositories/snapshots/org/apache/avro/avro-maven-plugin/1.8.0-SNAPSHOT/maven-metadata.xml
(2 KB at 3.9 KB/sec)
Uploading: https://repository.apache.org/content/repositories/snapshots/org/apache/avro/avro-maven-plugin/maven-metadata.xml
328/328 B   
            
Uploaded: https://repository.apache.org/content/repositories/snapshots/org/apache/avro/avro-maven-plugin/maven-metadata.xml
(328 B at 0.9 KB/sec)
Uploading: https://repository.apache.org/content/repositories/snapshots/org/apache/avro/maven-metadata.xml
235/235 B   
            
Uploaded: https://repository.apache.org/content/repositories/snapshots/org/apache/avro/maven-metadata.xml
(235 B at 0.6 KB/sec)
Uploading: https://repository.apache.org/content/repositories/snapshots/org/apache/avro/avro-maven-plugin/1.8.0-SNAPSHOT/avro-maven-plugin-1.8.0-20141108.013143-17-sources.jar
2/8 KB      
4/8 KB   
6/8 KB   
8/8 KB   
         
Uploaded: https://repository.apache.org/content/repositories/snapshots/org/apache/avro/avro-maven-plugin/1.8.0-SNAPSHOT/avro-maven-plugin-1.8.0-20141108.013143-17-sources.jar
(8 KB at 20.1 KB/sec)
Uploading: https://repository.apache.org/content/repositories/snapshots/org/apache/avro/avro-maven-plugin/1.8.0-SNAPSHOT/maven-metadata.xml
2/2 KB   
         
Uploaded: https://repository.apache.org/content/repositories/snapshots/org/apache/avro/avro-maven-plugin/1.8.0-SNAPSHOT/maven-metadata.xml
(2 KB at 3.5 KB/sec)
Uploading: https://repository.apache.org/content/repositories/snapshots/org/apache/avro/avro-maven-plugin/1.8.0-SNAPSHOT/avro-maven-plugin-1.8.0-20141108.013143-17-tests.jar
2/16 KB   
4/16 KB   
6/16 KB   
8/16 KB   
10/16 KB   
12/16 KB   
14/16 KB   
16/16 KB   
           
Uploaded: https://repository.apache.org/content/repositories/snapshots/org/apache/avro/avro-maven-plugin/1.8.0-SNAPSHOT/avro-maven-plugin-1.8.0-20141108.013143-17-tests.jar
(16 KB at 43.3 KB/sec)
Uploading: https://repository.apache.org/content/repositories/snapshots/org/apache/avro/avro-maven-plugin/1.8.0-SNAPSHOT/maven-metadata.xml
2/2 KB     
         
Uploaded: https://repository.apache.org/content/repositories/snapshots/org/apache/avro/avro-maven-plugin/1.8.0-SNAPSHOT/maven-metadata.xml
(2 KB at 3.5 KB/sec)
[INFO]                                                                         
[INFO] ------------------------------------------------------------------------
[INFO] Building Apache Avro IPC 1.8.0-SNAPSHOT
[INFO] ------------------------------------------------------------------------
[WARNING] The POM for org.eclipse.m2e:lifecycle-mapping:jar:1.0.0 is missing, no dependency
information available
[WARNING] Failed to retrieve plugin descriptor for org.eclipse.m2e:lifecycle-mapping:1.0.0:
Plugin org.eclipse.m2e:lifecycle-mapping:1.0.0 or one of its dependencies could not be resolved:
Failed to read artifact descriptor for org.eclipse.m2e:lifecycle-mapping:jar:1.0.0
[INFO] 
[INFO] --- maven-source-plugin:2.3:jar-no-fork (default-cli) @ avro-ipc ---
[INFO] Building jar: <https://builds.apache.org/job/AvroJava/ws/trunk/lang/java/ipc/target/avro-ipc-1.8.0-SNAPSHOT-sources.jar>
[INFO] 
[INFO] --- avro-maven-plugin:1.8.0-SNAPSHOT:schema (schemas) @ avro-ipc ---
[INFO] 
[INFO] --- avro-maven-plugin:1.8.0-SNAPSHOT:protocol (schemas) @ avro-ipc ---
[INFO] 
[INFO] --- avro-maven-plugin:1.8.0-SNAPSHOT:idl-protocol (schemas) @ avro-ipc ---
[INFO] 
[INFO] --- maven-remote-resources-plugin:1.2.1:process (default) @ avro-ipc ---
[INFO] 
[INFO] --- maven-resources-plugin:2.5:resources (default-resources) @ avro-ipc ---
[debug] execute contextualize
[INFO] Using 'UTF-8' encoding to copy filtered resources.
[INFO] Copying 6 resources
[INFO] Copying 3 resources
[INFO] 
[INFO] --- maven-compiler-plugin:3.1:compile (default-compile) @ avro-ipc ---
[INFO] Changes detected - recompiling the module!
[INFO] Compiling 57 source files to <https://builds.apache.org/job/AvroJava/ws/trunk/lang/java/ipc/target/classes>
[WARNING] <https://builds.apache.org/job/AvroJava/ws/trunk/lang/java/ipc/src/main/java/org/apache/avro/ipc/SaslSocketServer.java>:
Some input files use or override a deprecated API.
[WARNING] <https://builds.apache.org/job/AvroJava/ws/trunk/lang/java/ipc/src/main/java/org/apache/avro/ipc/SaslSocketServer.java>:
Recompile with -Xlint:deprecation for details.
[WARNING] <https://builds.apache.org/job/AvroJava/ws/trunk/lang/java/ipc/target/generated-sources/java/org/apache/avro/ipc/MD5.java>:
Some input files use unchecked or unsafe operations.
[WARNING] <https://builds.apache.org/job/AvroJava/ws/trunk/lang/java/ipc/target/generated-sources/java/org/apache/avro/ipc/MD5.java>:
Recompile with -Xlint:unchecked for details.
[INFO] 
[INFO] --- maven-bundle-plugin:2.5.3:manifest (bundle-manifest) @ avro-ipc ---
[INFO] 
[INFO] --- maven-resources-plugin:2.5:testResources (default-testResources) @ avro-ipc ---
[debug] execute contextualize
[INFO] Using 'UTF-8' encoding to copy filtered resources.
[INFO] Copying 1 resource
[INFO] Copying 3 resources
[INFO] 
[INFO] --- maven-compiler-plugin:3.1:testCompile (default-testCompile) @ avro-ipc ---
[INFO] Changes detected - recompiling the module!
[INFO] Compiling 93 source files to <https://builds.apache.org/job/AvroJava/ws/trunk/lang/java/ipc/target/test-classes>
[WARNING] <https://builds.apache.org/job/AvroJava/ws/trunk/lang/java/ipc/src/test/java/org/apache/avro/TestNamespaceReflect.java>:
Some input files use or override a deprecated API.
[WARNING] <https://builds.apache.org/job/AvroJava/ws/trunk/lang/java/ipc/src/test/java/org/apache/avro/TestNamespaceReflect.java>:
Recompile with -Xlint:deprecation for details.
[WARNING] <https://builds.apache.org/job/AvroJava/ws/trunk/lang/java/ipc/target/generated-test-sources/java/org/apache/avro/test/namespace/TestRecord.java>:
Some input files use unchecked or unsafe operations.
[WARNING] <https://builds.apache.org/job/AvroJava/ws/trunk/lang/java/ipc/target/generated-test-sources/java/org/apache/avro/test/namespace/TestRecord.java>:
Recompile with -Xlint:unchecked for details.
[INFO] 
[INFO] --- maven-surefire-plugin:2.17:test (default-test) @ avro-ipc ---
[WARNING] The parameter forkMode is deprecated since version 2.14. Use forkCount and reuseForks
instead.
[INFO] Surefire report directory: <https://builds.apache.org/job/AvroJava/ws/trunk/lang/java/ipc/target/surefire-reports>

-------------------------------------------------------
 T E S T S
-------------------------------------------------------

-------------------------------------------------------
 T E S T S
-------------------------------------------------------
Running org.apache.avro.generic.TestDeepCopy
Tests run: 1, Failures: 0, Errors: 0, Skipped: 0, Time elapsed: 0.363 sec - in org.apache.avro.generic.TestDeepCopy
Running org.apache.avro.TestProtocolGeneric
Tests run: 7, Failures: 0, Errors: 0, Skipped: 0, Time elapsed: 0.542 sec - in org.apache.avro.TestProtocolGeneric
Running org.apache.avro.TestProtocolSpecific
Tests run: 14, Failures: 0, Errors: 0, Skipped: 0, Time elapsed: 1.47 sec - in org.apache.avro.TestProtocolSpecific
Running org.apache.avro.TestProtocolHttp
Tests run: 16, Failures: 0, Errors: 0, Skipped: 0, Time elapsed: 2.934 sec - in org.apache.avro.TestProtocolHttp
Running org.apache.avro.TestDataFileSpecific
Tests run: 1, Failures: 0, Errors: 0, Skipped: 0, Time elapsed: 0.408 sec - in org.apache.avro.TestDataFileSpecific
Running org.apache.avro.TestProtocolGenericMeta
Tests run: 7, Failures: 0, Errors: 0, Skipped: 0, Time elapsed: 0.547 sec - in org.apache.avro.TestProtocolGenericMeta
Running org.apache.avro.TestProtocolParsing
Tests run: 4, Failures: 0, Errors: 0, Skipped: 0, Time elapsed: 0.345 sec - in org.apache.avro.TestProtocolParsing
Running org.apache.avro.TestBulkData
Tests run: 2, Failures: 0, Errors: 0, Skipped: 0, Time elapsed: 0.779 sec - in org.apache.avro.TestBulkData
Running org.apache.avro.TestNamespaceReflect
Tests run: 2, Failures: 0, Errors: 0, Skipped: 0, Time elapsed: 0.516 sec - in org.apache.avro.TestNamespaceReflect
Running org.apache.avro.TestProtocolReflect
Tests run: 7, Failures: 0, Errors: 0, Skipped: 0, Time elapsed: 0.523 sec - in org.apache.avro.TestProtocolReflect
Running org.apache.avro.TestProtocolDatagram
Tests run: 14, Failures: 0, Errors: 0, Skipped: 0, Time elapsed: 1.575 sec - in org.apache.avro.TestProtocolDatagram
Running org.apache.avro.TestProtocolReflectMeta
Tests run: 7, Failures: 0, Errors: 0, Skipped: 0, Time elapsed: 0.55 sec - in org.apache.avro.TestProtocolReflectMeta
Running org.apache.avro.TestNamespaceSpecific
Tests run: 2, Failures: 0, Errors: 0, Skipped: 0, Time elapsed: 0.509 sec - in org.apache.avro.TestNamespaceSpecific
Running org.apache.avro.TestProtocolNetty
Tests run: 14, Failures: 0, Errors: 0, Skipped: 0, Time elapsed: 2.114 sec - in org.apache.avro.TestProtocolNetty
Running org.apache.avro.compiler.specific.TestSpecificCompiler
Tests run: 19, Failures: 0, Errors: 0, Skipped: 0, Time elapsed: 3.247 sec - in org.apache.avro.compiler.specific.TestSpecificCompiler
Running org.apache.avro.TestCompare
Tests run: 14, Failures: 0, Errors: 0, Skipped: 0, Time elapsed: 0.381 sec - in org.apache.avro.TestCompare
Running org.apache.avro.TestSchema
Tests run: 56, Failures: 0, Errors: 0, Skipped: 0, Time elapsed: 4.364 sec - in org.apache.avro.TestSchema
Running org.apache.avro.TestProtocolSpecificMeta
Tests run: 14, Failures: 0, Errors: 0, Skipped: 0, Time elapsed: 1.513 sec - in org.apache.avro.TestProtocolSpecificMeta
Running org.apache.avro.ipc.TestNettyServerWithCallbacks
Tests run: 11, Failures: 0, Errors: 0, Skipped: 1, Time elapsed: 5.949 sec - in org.apache.avro.ipc.TestNettyServerWithCallbacks
Running org.apache.avro.ipc.TestNettyServerWithCompression
Tests run: 5, Failures: 0, Errors: 0, Skipped: 0, Time elapsed: 0.724 sec - in org.apache.avro.ipc.TestNettyServerWithCompression
Running org.apache.avro.ipc.TestSaslAnonymous
Tests run: 8, Failures: 0, Errors: 0, Skipped: 0, Time elapsed: 0.558 sec - in org.apache.avro.ipc.TestSaslAnonymous
Running org.apache.avro.ipc.TestNettyServerConcurrentExecution
Tests run: 1, Failures: 0, Errors: 0, Skipped: 0, Time elapsed: 0.71 sec - in org.apache.avro.ipc.TestNettyServerConcurrentExecution
Running org.apache.avro.ipc.trace.TestTraceCollection
Tests run: 1, Failures: 0, Errors: 0, Skipped: 0, Time elapsed: 2.149 sec - in org.apache.avro.ipc.trace.TestTraceCollection
Running org.apache.avro.ipc.trace.TestTraceConfigurations
Tests run: 1, Failures: 0, Errors: 0, Skipped: 0, Time elapsed: 0.06 sec - in org.apache.avro.ipc.trace.TestTraceConfigurations
Running org.apache.avro.ipc.trace.TestTracingUtil
Tests run: 1, Failures: 0, Errors: 0, Skipped: 0, Time elapsed: 0.072 sec - in org.apache.avro.ipc.trace.TestTracingUtil
Running org.apache.avro.ipc.trace.TestSpanAggregation
Tests run: 3, Failures: 0, Errors: 0, Skipped: 0, Time elapsed: 0.362 sec - in org.apache.avro.ipc.trace.TestSpanAggregation
Running org.apache.avro.ipc.trace.TestBasicTracing
Tests run: 2, Failures: 0, Errors: 0, Skipped: 0, Time elapsed: 2.342 sec - in org.apache.avro.ipc.trace.TestBasicTracing
Running org.apache.avro.ipc.trace.TestStaticServlet
Tests run: 1, Failures: 0, Errors: 0, Skipped: 0, Time elapsed: 0.085 sec - in org.apache.avro.ipc.trace.TestStaticServlet
Running org.apache.avro.ipc.trace.TestSpanTraceFormation
Tests run: 4, Failures: 0, Errors: 0, Skipped: 0, Time elapsed: 0.36 sec - in org.apache.avro.ipc.trace.TestSpanTraceFormation
Running org.apache.avro.ipc.trace.TestFileSpanStorage
Tests run: 4, Failures: 1, Errors: 0, Skipped: 0, Time elapsed: 5.149 sec <<< FAILURE!
- in org.apache.avro.ipc.trace.TestFileSpanStorage
testRangeQuery1(org.apache.avro.ipc.trace.TestFileSpanStorage)  Time elapsed: 1.019 sec  <<<
FAILURE!
java.lang.AssertionError: expected:<8> but was:<16>
	at org.junit.Assert.fail(Assert.java:88)
	at org.junit.Assert.failNotEquals(Assert.java:743)
	at org.junit.Assert.assertEquals(Assert.java:118)
	at org.junit.Assert.assertEquals(Assert.java:555)
	at org.junit.Assert.assertEquals(Assert.java:542)
	at org.apache.avro.ipc.trace.TestFileSpanStorage.testRangeQuery1(TestFileSpanStorage.java:159)

Running org.apache.avro.ipc.trace.TestTraceSingletons
Tests run: 4, Failures: 0, Errors: 0, Skipped: 0, Time elapsed: 0.623 sec - in org.apache.avro.ipc.trace.TestTraceSingletons
Running org.apache.avro.ipc.trace.TestEndToEndTracing
Tests run: 2, Failures: 0, Errors: 0, Skipped: 0, Time elapsed: 4.986 sec - in org.apache.avro.ipc.trace.TestEndToEndTracing
Running org.apache.avro.ipc.TestNettyServer
Tests run: 5, Failures: 0, Errors: 0, Skipped: 0, Time elapsed: 0.727 sec - in org.apache.avro.ipc.TestNettyServer
Running org.apache.avro.ipc.TestNettyServerWithSSL
Tests run: 5, Failures: 0, Errors: 0, Skipped: 0, Time elapsed: 0.736 sec - in org.apache.avro.ipc.TestNettyServerWithSSL
Running org.apache.avro.ipc.stats.TestStatsPluginAndServlet
Tests run: 3, Failures: 0, Errors: 0, Skipped: 0, Time elapsed: 0.675 sec - in org.apache.avro.ipc.stats.TestStatsPluginAndServlet
Running org.apache.avro.ipc.stats.TestStopwatch
Tests run: 6, Failures: 0, Errors: 0, Skipped: 0, Time elapsed: 0.064 sec - in org.apache.avro.ipc.stats.TestStopwatch
Running org.apache.avro.ipc.stats.TestHistogram
Tests run: 3, Failures: 0, Errors: 0, Skipped: 0, Time elapsed: 0.069 sec - in org.apache.avro.ipc.stats.TestHistogram
Running org.apache.avro.ipc.TestLocalTransceiver
Tests run: 1, Failures: 0, Errors: 0, Skipped: 0, Time elapsed: 0.428 sec - in org.apache.avro.ipc.TestLocalTransceiver
Running org.apache.avro.ipc.TestRpcPluginOrdering
Tests run: 1, Failures: 0, Errors: 0, Skipped: 0, Time elapsed: 0.469 sec - in org.apache.avro.ipc.TestRpcPluginOrdering
Running org.apache.avro.ipc.TestSaslDigestMd5
Tests run: 9, Failures: 0, Errors: 0, Skipped: 0, Time elapsed: 0.803 sec - in org.apache.avro.ipc.TestSaslDigestMd5
Running org.apache.avro.ipc.specific.TestSpecificRequestor
Tests run: 3, Failures: 0, Errors: 0, Skipped: 0, Time elapsed: 0.391 sec - in org.apache.avro.ipc.specific.TestSpecificRequestor
Running org.apache.avro.specific.TestSpecificDatumReader
Tests run: 2, Failures: 0, Errors: 0, Skipped: 0, Time elapsed: 0.382 sec - in org.apache.avro.specific.TestSpecificDatumReader
Running org.apache.avro.specific.TestSpecificErrorBuilder
Tests run: 2, Failures: 0, Errors: 0, Skipped: 0, Time elapsed: 0.356 sec - in org.apache.avro.specific.TestSpecificErrorBuilder
Running org.apache.avro.specific.TestSpecificRecordBuilder
Tests run: 10, Failures: 0, Errors: 0, Skipped: 3, Time elapsed: 0.422 sec - in org.apache.avro.specific.TestSpecificRecordBuilder
Running org.apache.avro.specific.TestSpecificDatumWriter
Tests run: 1, Failures: 0, Errors: 0, Skipped: 0, Time elapsed: 0.376 sec - in org.apache.avro.specific.TestSpecificDatumWriter
Running org.apache.avro.specific.TestSpecificData
Tests run: 8, Failures: 0, Errors: 0, Skipped: 0, Time elapsed: 0.429 sec - in org.apache.avro.specific.TestSpecificData
Running org.apache.avro.TestProtocolHttps
Tests run: 14, Failures: 0, Errors: 0, Skipped: 0, Time elapsed: 3.024 sec - in org.apache.avro.TestProtocolHttps

Results :

Failed tests: 
  TestFileSpanStorage.testRangeQuery1:159 expected:<8> but was:<16>

Tests run: 322, Failures: 1, Errors: 0, Skipped: 4

[INFO] ------------------------------------------------------------------------
[INFO] Reactor Summary:
[INFO] 
[INFO] Apache Avro Toplevel .............................. SUCCESS [3.491s]
[INFO] Apache Avro Java .................................. SUCCESS [3.938s]
[INFO] Apache Avro ....................................... SUCCESS [51.866s]
[INFO] Apache Avro Compiler .............................. SUCCESS [6.837s]
[INFO] Apache Avro Maven Plugin .......................... SUCCESS [11.316s]
[INFO] Apache Avro IPC ................................... FAILURE [1:08.285s]
[INFO] Trevni Java ....................................... SKIPPED
[INFO] Trevni Java Core .................................. SKIPPED
[INFO] Apache Avro Mapred API ............................ SKIPPED
[INFO] Trevni Java Avro .................................. SKIPPED
[INFO] Trevni Specification .............................. SKIPPED
[INFO] Apache Avro Tools ................................. SKIPPED
[INFO] Apache Avro Protobuf Compatibility ................ SKIPPED
[INFO] Apache Avro Thrift Compatibility .................. SKIPPED
[INFO] Apache Avro Maven Archetypes ...................... SKIPPED
[INFO] Apache Avro Maven Service Archetype ............... SKIPPED
[INFO] ------------------------------------------------------------------------
[INFO] BUILD FAILURE
[INFO] ------------------------------------------------------------------------
[INFO] Total time: 2:28.601s
[INFO] Finished at: Sat Nov 08 01:32:55 UTC 2014
[INFO] Final Memory: 50M/390M
[INFO] ------------------------------------------------------------------------
[ERROR] Failed to execute goal org.apache.maven.plugins:maven-surefire-plugin:2.17:test (default-test)
on project avro-ipc: There are test failures.
[ERROR] 
[ERROR] Please refer to <https://builds.apache.org/job/AvroJava/ws/trunk/lang/java/ipc/target/surefire-reports>
for the individual test results.
[ERROR] -> [Help 1]
[ERROR] 
[ERROR] To see the full stack trace of the errors, re-run Maven with the -e switch.
[ERROR] Re-run Maven using the -X switch to enable full debug logging.
[ERROR] 
[ERROR] For more information about the errors and possible solutions, please read the following
articles:
[ERROR] [Help 1] http://cwiki.apache.org/confluence/display/MAVEN/MojoFailureException
[ERROR] 
[ERROR] After correcting the problems, you can resume the build with the command
[ERROR]   mvn <goals> -rf :avro-ipc
Build step 'Invoke top-level Maven targets' marked build as failure
[WARNINGS] Skipping publisher since build result is FAILURE
Recording test results
Updating AVRO-1592
Updating AVRO-1597

Mime
View raw message