avro-dev mailing list archives

Site index · List index
Message view « Date » · « Thread »
Top « Date » · « Thread »
From Apache Jenkins Server <jenk...@builds.apache.org>
Subject Build failed in Jenkins: AvroJava #481
Date Mon, 22 Sep 2014 22:39:09 GMT
See <https://builds.apache.org/job/AvroJava/481/changes>

Changes:

[cutting] AVRO-1589. Java: Fix ReflectData.AllowNulls to not create unions for primitive types.
 Contributed by Ryan Blue.

[cutting] AVRO-1334. Java: Update versions of many dependencies.

------------------------------------------
[...truncated 11002 lines...]
1179/1201 KB   174/174 KB   386/526 KB   68/273 KB   
1179/1201 KB   174/174 KB   390/526 KB   72/273 KB   
1179/1201 KB   174/174 KB   390/526 KB   72/273 KB   
1179/1201 KB   174/174 KB   390/526 KB   72/273 KB   
1179/1201 KB   174/174 KB   390/526 KB   76/273 KB   
1183/1201 KB   174/174 KB   390/526 KB   76/273 KB   
1183/1201 KB   174/174 KB   390/526 KB   80/273 KB   
1187/1201 KB   174/174 KB   390/526 KB   80/273 KB   
1187/1201 KB   174/174 KB   390/526 KB   84/273 KB   
1191/1201 KB   174/174 KB   390/526 KB   84/273 KB   
1191/1201 KB   174/174 KB   390/526 KB   88/273 KB   
1195/1201 KB   174/174 KB   390/526 KB   88/273 KB   
1195/1201 KB   174/174 KB   390/526 KB   92/273 KB   
1199/1201 KB   174/174 KB   390/526 KB   92/273 KB   
1199/1201 KB   174/174 KB   390/526 KB   96/273 KB   
1199/1201 KB   174/174 KB   390/526 KB   100/273 KB   
1199/1201 KB   174/174 KB   390/526 KB   104/273 KB   
1199/1201 KB   174/174 KB   390/526 KB   108/273 KB   
1199/1201 KB   174/174 KB   390/526 KB   112/273 KB   
1199/1201 KB   174/174 KB   390/526 KB   116/273 KB   
1199/1201 KB   174/174 KB   390/526 KB   119/273 KB   
                                                      
Downloaded: http://repo.maven.apache.org/maven2/org/mortbay/jetty/jetty-util/6.1.25/jetty-util-6.1.25.jar
(174 KB at 5243.1 KB/sec)
1201/1201 KB   390/526 KB   119/273 KB                
1201/1201 KB   392/526 KB   119/273 KB   
1201/1201 KB   396/526 KB   119/273 KB   
1201/1201 KB   400/526 KB   119/273 KB   
1201/1201 KB   400/526 KB   123/273 KB   
1201/1201 KB   404/526 KB   123/273 KB   
1201/1201 KB   404/526 KB   127/273 KB   
1201/1201 KB   408/526 KB   127/273 KB   
1201/1201 KB   412/526 KB   127/273 KB   
1201/1201 KB   414/526 KB   127/273 KB   
1201/1201 KB   416/526 KB   127/273 KB   
1201/1201 KB   417/526 KB   127/273 KB   
1201/1201 KB   419/526 KB   127/273 KB   
1201/1201 KB   423/526 KB   127/273 KB   
1201/1201 KB   427/526 KB   127/273 KB   
1201/1201 KB   431/526 KB   127/273 KB   
1201/1201 KB   435/526 KB   127/273 KB   
1201/1201 KB   439/526 KB   127/273 KB   
1201/1201 KB   443/526 KB   127/273 KB   
1201/1201 KB   447/526 KB   127/273 KB   
1201/1201 KB   451/526 KB   127/273 KB   
1201/1201 KB   455/526 KB   127/273 KB   
1201/1201 KB   459/526 KB   127/273 KB   
1201/1201 KB   463/526 KB   127/273 KB   
1201/1201 KB   467/526 KB   127/273 KB   
1201/1201 KB   471/526 KB   127/273 KB   
1201/1201 KB   475/526 KB   127/273 KB   
1201/1201 KB   479/526 KB   127/273 KB   
1201/1201 KB   481/526 KB   127/273 KB   
1201/1201 KB   482/526 KB   127/273 KB   
1201/1201 KB   485/526 KB   127/273 KB   
1201/1201 KB   489/526 KB   127/273 KB   
1201/1201 KB   493/526 KB   127/273 KB   
1201/1201 KB   497/526 KB   127/273 KB   
                                         
501/526 KB   127/273 KB                  
Downloaded: http://repo.maven.apache.org/maven2/xerces/xercesImpl/2.9.1/xercesImpl-2.9.1.jar
(1201 KB at 8573.7 KB/sec)
505/526 KB   127/273 KB   
509/526 KB   127/273 KB   
509/526 KB   131/273 KB   
512/526 KB   131/273 KB   
512/526 KB   135/273 KB   
513/526 KB   135/273 KB   
513/526 KB   139/273 KB   
513/526 KB   143/273 KB   
513/526 KB   147/273 KB   
513/526 KB   151/273 KB   
513/526 KB   155/273 KB   
513/526 KB   159/273 KB   
513/526 KB   163/273 KB   
513/526 KB   167/273 KB   
513/526 KB   171/273 KB   
513/526 KB   175/273 KB   
513/526 KB   179/273 KB   
513/526 KB   183/273 KB   
513/526 KB   187/273 KB   
513/526 KB   191/273 KB   
513/526 KB   195/273 KB   
513/526 KB   199/273 KB   
513/526 KB   203/273 KB   
513/526 KB   207/273 KB   
513/526 KB   211/273 KB   
513/526 KB   215/273 KB   
513/526 KB   219/273 KB   
513/526 KB   223/273 KB   
517/526 KB   223/273 KB   
517/526 KB   227/273 KB   
521/526 KB   227/273 KB   
521/526 KB   231/273 KB   
525/526 KB   231/273 KB   
525/526 KB   235/273 KB   
525/526 KB   239/273 KB   
526/526 KB   239/273 KB   
526/526 KB   243/273 KB   
526/526 KB   247/273 KB   
526/526 KB   251/273 KB   
526/526 KB   255/273 KB   
526/526 KB   256/273 KB   
526/526 KB   257/273 KB   
526/526 KB   261/273 KB   
526/526 KB   265/273 KB   
526/526 KB   269/273 KB   
526/526 KB   273/273 KB   
                          
Downloaded: http://repo.maven.apache.org/maven2/org/mortbay/jetty/jetty/6.1.25/jetty-6.1.25.jar
(526 KB at 8914.5 KB/sec)
                          
Downloaded: http://repo.maven.apache.org/maven2/commons-lang/commons-lang/2.5/commons-lang-2.5.jar
(273 KB at 7573.6 KB/sec)
[INFO] 
[INFO] --- maven-install-plugin:2.3.1:install (default-install) @ avro-toplevel ---
Downloading: http://repo.maven.apache.org/maven2/org/codehaus/plexus/plexus-digest/1.0/plexus-digest-1.0.pom
2/2 KB                    
         
Downloaded: http://repo.maven.apache.org/maven2/org/codehaus/plexus/plexus-digest/1.0/plexus-digest-1.0.pom
(2 KB at 54.4 KB/sec)
Downloading: http://repo.maven.apache.org/maven2/org/codehaus/plexus/plexus-components/1.1.7/plexus-components-1.1.7.pom
3/5 KB   
5/5 KB   
         
Downloaded: http://repo.maven.apache.org/maven2/org/codehaus/plexus/plexus-components/1.1.7/plexus-components-1.1.7.pom
(5 KB at 255.7 KB/sec)
Downloading: http://repo.maven.apache.org/maven2/org/codehaus/plexus/plexus-digest/1.0/plexus-digest-1.0.jar
4/12 KB   
8/12 KB   
12/12 KB   
           
Downloaded: http://repo.maven.apache.org/maven2/org/codehaus/plexus/plexus-digest/1.0/plexus-digest-1.0.jar
(12 KB at 609.5 KB/sec)
[INFO] Installing <https://builds.apache.org/job/AvroJava/ws/trunk/pom.xml> to /home/jenkins/.m2/repository/org/apache/avro/avro-toplevel/1.8.0-SNAPSHOT/avro-toplevel-1.8.0-SNAPSHOT.pom
[INFO] 
[INFO] --- maven-deploy-plugin:2.6:deploy (default-deploy) @ avro-toplevel ---
Downloading: http://repo.maven.apache.org/maven2/org/codehaus/plexus/plexus-utils/1.5.6/plexus-utils-1.5.6.pom
3/6 KB     
6/6 KB   
         
Downloaded: http://repo.maven.apache.org/maven2/org/codehaus/plexus/plexus-utils/1.5.6/plexus-utils-1.5.6.pom
(6 KB at 287.7 KB/sec)
Downloading: http://repo.maven.apache.org/maven2/org/codehaus/plexus/plexus/1.0.12/plexus-1.0.12.pom
4/10 KB   
8/10 KB   
10/10 KB   
           
Downloaded: http://repo.maven.apache.org/maven2/org/codehaus/plexus/plexus/1.0.12/plexus-1.0.12.pom
(10 KB at 531.7 KB/sec)
Downloading: http://repo.maven.apache.org/maven2/org/codehaus/plexus/plexus-utils/1.5.6/plexus-utils-1.5.6.jar
4/245 KB   
8/245 KB   
12/245 KB   
16/245 KB   
20/245 KB   
24/245 KB   
28/245 KB   
32/245 KB   
36/245 KB   
40/245 KB   
44/245 KB   
48/245 KB   
52/245 KB   
56/245 KB   
60/245 KB   
64/245 KB   
68/245 KB   
72/245 KB   
76/245 KB   
80/245 KB   
84/245 KB   
88/245 KB   
92/245 KB   
96/245 KB   
100/245 KB   
104/245 KB   
108/245 KB   
112/245 KB   
116/245 KB   
120/245 KB   
124/245 KB   
125/245 KB   
129/245 KB   
133/245 KB   
137/245 KB   
141/245 KB   
145/245 KB   
146/245 KB   
147/245 KB   
151/245 KB   
155/245 KB   
159/245 KB   
163/245 KB   
167/245 KB   
171/245 KB   
175/245 KB   
179/245 KB   
183/245 KB   
187/245 KB   
191/245 KB   
195/245 KB   
199/245 KB   
203/245 KB   
207/245 KB   
211/245 KB   
215/245 KB   
219/245 KB   
223/245 KB   
227/245 KB   
231/245 KB   
235/245 KB   
239/245 KB   
243/245 KB   
245/245 KB   
             
Downloaded: http://repo.maven.apache.org/maven2/org/codehaus/plexus/plexus-utils/1.5.6/plexus-utils-1.5.6.jar
(245 KB at 9062.0 KB/sec)
Downloading: https://repository.apache.org/content/repositories/snapshots/org/apache/avro/avro-toplevel/1.8.0-SNAPSHOT/maven-metadata.xml
             
[WARNING] Could not transfer metadata org.apache.avro:avro-toplevel:1.8.0-SNAPSHOT/maven-metadata.xml
from/to apache.snapshots.https (https://repository.apache.org/content/repositories/snapshots):
Not authorized, ReasonPhrase:Unauthorized.
[INFO] ------------------------------------------------------------------------
[INFO] Reactor Summary:
[INFO] 
[INFO] Apache Avro Toplevel .............................. FAILURE [6.186s]
[INFO] Apache Avro Java .................................. SKIPPED
[INFO] Apache Avro ....................................... SKIPPED
[INFO] Apache Avro Compiler .............................. SKIPPED
[INFO] Apache Avro Maven Plugin .......................... SKIPPED
[INFO] Apache Avro IPC ................................... SKIPPED
[INFO] Trevni Java ....................................... SKIPPED
[INFO] Trevni Java Core .................................. SKIPPED
[INFO] Apache Avro Mapred API ............................ SKIPPED
[INFO] Trevni Java Avro .................................. SKIPPED
[INFO] Trevni Specification .............................. SKIPPED
[INFO] Apache Avro Tools ................................. SKIPPED
[INFO] Apache Avro Protobuf Compatibility ................ SKIPPED
[INFO] Apache Avro Thrift Compatibility .................. SKIPPED
[INFO] Apache Avro Maven Archetypes ...................... SKIPPED
[INFO] Apache Avro Maven Service Archetype ............... SKIPPED
[INFO] ------------------------------------------------------------------------
[INFO] BUILD FAILURE
[INFO] ------------------------------------------------------------------------
[INFO] Total time: 15.815s
[INFO] Finished at: Mon Sep 22 22:39:05 UTC 2014
[INFO] Final Memory: 22M/349M
[INFO] ------------------------------------------------------------------------
[ERROR] Failed to execute goal org.apache.maven.plugins:maven-deploy-plugin:2.6:deploy (default-deploy)
on project avro-toplevel: Failed to retrieve remote metadata org.apache.avro:avro-toplevel:1.8.0-SNAPSHOT/maven-metadata.xml:
Could not transfer metadata org.apache.avro:avro-toplevel:1.8.0-SNAPSHOT/maven-metadata.xml
from/to apache.snapshots.https (https://repository.apache.org/content/repositories/snapshots):
Not authorized, ReasonPhrase:Unauthorized. -> [Help 1]
[ERROR] 
[ERROR] To see the full stack trace of the errors, re-run Maven with the -e switch.
[ERROR] Re-run Maven using the -X switch to enable full debug logging.
[ERROR] 
[ERROR] For more information about the errors and possible solutions, please read the following
articles:
[ERROR] [Help 1] http://cwiki.apache.org/confluence/display/MAVEN/MojoExecutionException
Build step 'Invoke top-level Maven targets' marked build as failure
[WARNINGS] Skipping publisher since build result is FAILURE
Recording test results
Updating AVRO-1334
Updating AVRO-1589

Mime
View raw message