avro-dev mailing list archives

Site index · List index
Message view « Date » · « Thread »
Top « Date » · « Thread »
From Apache Jenkins Server <jenk...@builds.apache.org>
Subject Build failed in Jenkins: AvroJava #442
Date Mon, 03 Mar 2014 15:35:30 GMT
See <https://builds.apache.org/job/AvroJava/442/changes>

Changes:

[tomwhite] AVRO-1455. Deep copy does not need to create new instances for primitives.

------------------------------------------
[...truncated 2393 lines...]
[debug] execute contextualize
[INFO] Using 'UTF-8' encoding to copy filtered resources.
[INFO] skip non existing resourceDirectory <https://builds.apache.org/job/AvroJava/ws/trunk/lang/java/maven-plugin/src/main/resources>
[INFO] Copying 3 resources
[INFO] 
[INFO] --- maven-compiler-plugin:2.3.2:compile (default-compile) @ avro-maven-plugin ---
[INFO] Compiling 5 source files to <https://builds.apache.org/job/AvroJava/ws/trunk/lang/java/maven-plugin/target/classes>
[INFO] 
[INFO] --- maven-bundle-plugin:2.1.0:manifest (bundle-manifest) @ avro-maven-plugin ---
[WARNING] Ignoring project type maven-plugin - supportedProjectTypes = [bundle]
[INFO] 
[INFO] --- maven-resources-plugin:2.5:testResources (default-testResources) @ avro-maven-plugin
---
[debug] execute contextualize
[INFO] Using 'UTF-8' encoding to copy filtered resources.
[INFO] Copying 3 resources
[INFO] Copying 3 resources
[INFO] 
[INFO] --- maven-compiler-plugin:2.3.2:testCompile (default-testCompile) @ avro-maven-plugin
---
[INFO] Compiling 4 source files to <https://builds.apache.org/job/AvroJava/ws/trunk/lang/java/maven-plugin/target/test-classes>
[INFO] 
[INFO] --- maven-surefire-plugin:2.12:test (default-test) @ avro-maven-plugin ---
[INFO] Surefire report directory: <https://builds.apache.org/job/AvroJava/ws/trunk/lang/java/maven-plugin/target/surefire-reports>

-------------------------------------------------------
 T E S T S
-------------------------------------------------------

-------------------------------------------------------
 T E S T S
-------------------------------------------------------
Running org.apache.avro.mojo.TestProtocolMojo
Tests run: 1, Failures: 0, Errors: 0, Skipped: 0, Time elapsed: 1.351 sec
Running org.apache.avro.mojo.TestIDLProtocolMojo
Tests run: 1, Failures: 0, Errors: 0, Skipped: 0, Time elapsed: 1.648 sec
Running org.apache.avro.mojo.TestSchemaMojo
Tests run: 1, Failures: 0, Errors: 0, Skipped: 0, Time elapsed: 1.561 sec

Results :

Tests run: 3, Failures: 0, Errors: 0, Skipped: 0

[INFO] 
[INFO] --- maven-checkstyle-plugin:2.8:check (checkstyle-check) @ avro-maven-plugin ---
[INFO] Starting audit...
Audit done.

[INFO] 
[INFO] --- maven-jar-plugin:2.3.2:jar (default-jar) @ avro-maven-plugin ---
[INFO] Building jar: <https://builds.apache.org/job/AvroJava/ws/trunk/lang/java/maven-plugin/target/avro-maven-plugin-1.7.7-SNAPSHOT.jar>
[INFO] 
[INFO] --- maven-plugin-plugin:2.9:addPluginArtifactMetadata (default-addPluginArtifactMetadata)
@ avro-maven-plugin ---
[INFO] 
[INFO] --- maven-site-plugin:3.0:attach-descriptor (attach-descriptor) @ avro-maven-plugin
---
[INFO]                                                                         
[INFO] ------------------------------------------------------------------------
[INFO] Building Apache Avro IPC 1.7.7-SNAPSHOT
[INFO] ------------------------------------------------------------------------
[INFO] 
[INFO] --- avro-maven-plugin:1.7.7-SNAPSHOT:schema (schemas) @ avro-ipc ---
[INFO] 
[INFO] --- avro-maven-plugin:1.7.7-SNAPSHOT:protocol (schemas) @ avro-ipc ---
[INFO] 
[INFO] --- avro-maven-plugin:1.7.7-SNAPSHOT:idl-protocol (schemas) @ avro-ipc ---
[INFO] 
[INFO] --- maven-remote-resources-plugin:1.2.1:process (default) @ avro-ipc ---
[INFO] 
[INFO] --- maven-resources-plugin:2.5:resources (default-resources) @ avro-ipc ---
[debug] execute contextualize
[INFO] Using 'UTF-8' encoding to copy filtered resources.
[INFO] Copying 6 resources
[INFO] Copying 3 resources
[INFO] 
[INFO] --- maven-compiler-plugin:2.3.2:compile (default-compile) @ avro-ipc ---
[INFO] Compiling 57 source files to <https://builds.apache.org/job/AvroJava/ws/trunk/lang/java/ipc/target/classes>
[INFO] 
[INFO] --- maven-bundle-plugin:2.1.0:manifest (bundle-manifest) @ avro-ipc ---
[INFO] 
[INFO] --- maven-resources-plugin:2.5:testResources (default-testResources) @ avro-ipc ---
[debug] execute contextualize
[INFO] Using 'UTF-8' encoding to copy filtered resources.
[INFO] Copying 1 resource
[INFO] Copying 3 resources
[INFO] 
[INFO] --- maven-compiler-plugin:2.3.2:testCompile (default-testCompile) @ avro-ipc ---
[INFO] Compiling 91 source files to <https://builds.apache.org/job/AvroJava/ws/trunk/lang/java/ipc/target/test-classes>
[INFO] 
[INFO] --- maven-surefire-plugin:2.12:test (default-test) @ avro-ipc ---
[INFO] Surefire report directory: <https://builds.apache.org/job/AvroJava/ws/trunk/lang/java/ipc/target/surefire-reports>

-------------------------------------------------------
 T E S T S
-------------------------------------------------------

-------------------------------------------------------
 T E S T S
-------------------------------------------------------
Running org.apache.avro.TestBulkData
Tests run: 2, Failures: 0, Errors: 0, Skipped: 0, Time elapsed: 1.078 sec
Running org.apache.avro.TestCompare
Tests run: 14, Failures: 0, Errors: 0, Skipped: 0, Time elapsed: 0.544 sec
Running org.apache.avro.specific.TestSpecificDatumReader
Tests run: 2, Failures: 0, Errors: 0, Skipped: 0, Time elapsed: 0.444 sec
Running org.apache.avro.specific.TestSpecificErrorBuilder
Tests run: 2, Failures: 0, Errors: 0, Skipped: 0, Time elapsed: 0.506 sec
Running org.apache.avro.specific.TestSpecificRecordBuilder
Tests run: 10, Failures: 0, Errors: 0, Skipped: 3, Time elapsed: 0.49 sec
Running org.apache.avro.specific.TestSpecificData
Tests run: 6, Failures: 0, Errors: 0, Skipped: 0, Time elapsed: 0.506 sec
Running org.apache.avro.specific.TestSpecificDatumWriter
Tests run: 1, Failures: 0, Errors: 0, Skipped: 0, Time elapsed: 0.483 sec
Running org.apache.avro.ipc.stats.TestHistogram
Tests run: 3, Failures: 0, Errors: 0, Skipped: 0, Time elapsed: 0.084 sec
Running org.apache.avro.ipc.stats.TestStatsPluginAndServlet
Tests run: 3, Failures: 0, Errors: 0, Skipped: 0, Time elapsed: 1.136 sec
Running org.apache.avro.ipc.stats.TestStopwatch
Tests run: 6, Failures: 0, Errors: 0, Skipped: 0, Time elapsed: 0.06 sec
Running org.apache.avro.ipc.trace.TestSpanTraceFormation
Tests run: 4, Failures: 0, Errors: 0, Skipped: 0, Time elapsed: 0.437 sec
Running org.apache.avro.ipc.trace.TestBasicTracing
Tests run: 2, Failures: 0, Errors: 0, Skipped: 0, Time elapsed: 1.984 sec
Running org.apache.avro.ipc.trace.TestTracingUtil
Tests run: 1, Failures: 0, Errors: 0, Skipped: 0, Time elapsed: 0.123 sec
Running org.apache.avro.ipc.trace.TestStaticServlet
Tests run: 1, Failures: 0, Errors: 0, Skipped: 0, Time elapsed: 0.084 sec
Running org.apache.avro.ipc.trace.TestTraceSingletons
Tests run: 4, Failures: 0, Errors: 0, Skipped: 0, Time elapsed: 0.963 sec
Running org.apache.avro.ipc.trace.TestEndToEndTracing
Tests run: 2, Failures: 0, Errors: 0, Skipped: 0, Time elapsed: 4.666 sec
Running org.apache.avro.ipc.trace.TestSpanAggregation
Tests run: 3, Failures: 0, Errors: 0, Skipped: 0, Time elapsed: 0.41 sec
Running org.apache.avro.ipc.trace.TestTraceConfigurations
Tests run: 1, Failures: 0, Errors: 0, Skipped: 0, Time elapsed: 0.068 sec
Running org.apache.avro.ipc.trace.TestTraceCollection
Tests run: 1, Failures: 0, Errors: 0, Skipped: 0, Time elapsed: 1.732 sec
Running org.apache.avro.ipc.trace.TestFileSpanStorage
Tests run: 4, Failures: 0, Errors: 0, Skipped: 0, Time elapsed: 17.186 sec
Running org.apache.avro.ipc.TestNettyTransceiverWhenServerStops
Tests run: 1, Failures: 0, Errors: 0, Skipped: 0, Time elapsed: 5.435 sec
Running org.apache.avro.ipc.TestNettyServer
Tests run: 5, Failures: 0, Errors: 0, Skipped: 0, Time elapsed: 0.916 sec
Running org.apache.avro.ipc.TestNettyServerWithSSL
Tests run: 5, Failures: 0, Errors: 0, Skipped: 0, Time elapsed: 1.012 sec
Running org.apache.avro.ipc.TestNettyServerConcurrentExecution
Tests run: 1, Failures: 0, Errors: 0, Skipped: 0, Time elapsed: 0.933 sec
Running org.apache.avro.ipc.TestRpcPluginOrdering
Tests run: 1, Failures: 0, Errors: 0, Skipped: 0, Time elapsed: 0.542 sec
Running org.apache.avro.ipc.TestSaslDigestMd5
Tests run: 9, Failures: 0, Errors: 0, Skipped: 0, Time elapsed: 1.222 sec
Running org.apache.avro.ipc.TestLocalTransceiver
Tests run: 1, Failures: 0, Errors: 0, Skipped: 0, Time elapsed: 0.56 sec
Running org.apache.avro.ipc.TestSaslAnonymous
Tests run: 8, Failures: 0, Errors: 0, Skipped: 0, Time elapsed: 0.638 sec
563 [SocketServer on 0.0.0.0/0.0.0.0:0] INFO org.apache.avro.ipc.SocketServer - stopping /0:0:0:0:0:0:0:0
Running org.apache.avro.ipc.TestNettyServerWithCompression
Tests run: 5, Failures: 1, Errors: 0, Skipped: 0, Time elapsed: 0.95 sec <<< FAILURE!
Running org.apache.avro.ipc.TestNettyServerWithCallbacks
Tests run: 11, Failures: 0, Errors: 0, Skipped: 1, Time elapsed: 4.144 sec
Running org.apache.avro.TestProtocolGeneric
Tests run: 7, Failures: 0, Errors: 0, Skipped: 0, Time elapsed: 0.763 sec
639 [SocketServer on 0.0.0.0/0.0.0.0:0] INFO org.apache.avro.ipc.SocketServer - stopping /0:0:0:0:0:0:0:0
Running org.apache.avro.TestProtocolDatagram
Tests run: 14, Failures: 0, Errors: 0, Skipped: 0, Time elapsed: 2.222 sec
Running org.apache.avro.TestProtocolHttps
Tests run: 14, Failures: 0, Errors: 0, Skipped: 0, Time elapsed: 3.591 sec
Running org.apache.avro.TestSchema
Tests run: 50, Failures: 0, Errors: 0, Skipped: 0, Time elapsed: 8.42 sec
Running org.apache.avro.TestProtocolNetty
Tests run: 14, Failures: 0, Errors: 0, Skipped: 0, Time elapsed: 2.233 sec
Running org.apache.avro.generic.TestDeepCopy
Tests run: 1, Failures: 0, Errors: 0, Skipped: 0, Time elapsed: 0.53 sec
Running org.apache.avro.TestProtocolParsing
Tests run: 4, Failures: 0, Errors: 0, Skipped: 0, Time elapsed: 0.532 sec
Running org.apache.avro.TestDataFileSpecific
Tests run: 1, Failures: 0, Errors: 0, Skipped: 0, Time elapsed: 0.681 sec
Running org.apache.avro.TestProtocolSpecific
Tests run: 14, Failures: 0, Errors: 0, Skipped: 0, Time elapsed: 1.438 sec
1346 [Connection to /67.195.138.8:59717] INFO org.apache.avro.ipc.SocketTransceiver - closing
to /67.195.138.8:59717
Running org.apache.avro.TestProtocolSpecificMeta
Tests run: 14, Failures: 0, Errors: 0, Skipped: 0, Time elapsed: 1.534 sec
Running org.apache.avro.TestProtocolHttp
Tests run: 16, Failures: 0, Errors: 0, Skipped: 0, Time elapsed: 4.447 sec
Running org.apache.avro.compiler.specific.TestSpecificCompiler
Tests run: 19, Failures: 0, Errors: 0, Skipped: 0, Time elapsed: 3.656 sec
Running org.apache.avro.TestProtocolReflect
Tests run: 7, Failures: 0, Errors: 0, Skipped: 0, Time elapsed: 0.609 sec
Running org.apache.avro.TestProtocolGenericMeta
Tests run: 7, Failures: 0, Errors: 0, Skipped: 0, Time elapsed: 0.611 sec
Running org.apache.avro.TestProtocolReflectMeta
Tests run: 7, Failures: 0, Errors: 0, Skipped: 0, Time elapsed: 0.744 sec
Running org.apache.avro.TestNamespaceSpecific
Tests run: 2, Failures: 0, Errors: 0, Skipped: 0, Time elapsed: 0.637 sec
Running org.apache.avro.TestNamespaceReflect
Tests run: 2, Failures: 0, Errors: 0, Skipped: 0, Time elapsed: 0.709 sec
587 [SocketServer on 0.0.0.0/0.0.0.0:0] INFO org.apache.avro.ipc.SocketServer - stopping /0:0:0:0:0:0:0:0

Results :

Failed tests:   testConnectionsCount(org.apache.avro.ipc.TestNettyServerWithCompression):
expected:<1> but was:<2>

Tests run: 312, Failures: 1, Errors: 0, Skipped: 4

[INFO]                                                                         
[INFO] ------------------------------------------------------------------------
[INFO] Skipping Apache Avro Toplevel
[INFO] This project has been banned from the build due to previous failures.
[INFO] ------------------------------------------------------------------------
[INFO] ------------------------------------------------------------------------
[INFO] Reactor Summary:
[INFO] 
[INFO] Apache Avro Toplevel .............................. SUCCESS [1.571s]
[INFO] Apache Avro Java .................................. SUCCESS [3.324s]
[INFO] Apache Avro ....................................... SUCCESS [1:43.040s]
[INFO] Apache Avro Compiler .............................. SUCCESS [7.832s]
[INFO] Apache Avro Maven Plugin .......................... SUCCESS [11.116s]
[INFO] Apache Avro IPC ................................... FAILURE [1:50.858s]
[INFO] Trevni Java ....................................... SKIPPED
[INFO] Trevni Java Core .................................. SKIPPED
[INFO] Apache Avro Mapred API ............................ SKIPPED
[INFO] Trevni Java Avro .................................. SKIPPED
[INFO] Trevni Specification .............................. SKIPPED
[INFO] Apache Avro Tools ................................. SKIPPED
[INFO] Apache Avro Protobuf Compatibility ................ SKIPPED
[INFO] Apache Avro Thrift Compatibility .................. SKIPPED
[INFO] Apache Avro Maven Archetypes ...................... SKIPPED
[INFO] Apache Avro Maven Service Archetype ............... SKIPPED
[INFO] ------------------------------------------------------------------------
[INFO] BUILD FAILURE
[INFO] ------------------------------------------------------------------------
[INFO] Total time: 4:01.198s
[INFO] Finished at: Mon Mar 03 15:35:19 UTC 2014
[INFO] Final Memory: 62M/402M
[INFO] ------------------------------------------------------------------------
[ERROR] Failed to execute goal org.apache.maven.plugins:maven-surefire-plugin:2.12:test (default-test)
on project avro-ipc: There are test failures.
[ERROR] 
[ERROR] Please refer to <https://builds.apache.org/job/AvroJava/ws/trunk/lang/java/ipc/target/surefire-reports>
for the individual test results.
[ERROR] -> [Help 1]
[ERROR] 
[ERROR] To see the full stack trace of the errors, re-run Maven with the -e switch.
[ERROR] Re-run Maven using the -X switch to enable full debug logging.
[ERROR] 
[ERROR] For more information about the errors and possible solutions, please read the following
articles:
[ERROR] [Help 1] http://cwiki.apache.org/confluence/display/MAVEN/MojoFailureException
[ERROR] 
[ERROR] After correcting the problems, you can resume the build with the command
[ERROR]   mvn <goals> -rf :avro-ipc
Build step 'Invoke top-level Maven targets' marked build as failure
[WARNINGS] Skipping publisher since build result is FAILURE
Recording test results
Updating AVRO-1455

Mime
View raw message