avro-dev mailing list archives

Site index · List index
Message view « Date » · « Thread »
Top « Date » · « Thread »
From Apache Jenkins Server <jenk...@builds.apache.org>
Subject Build failed in Jenkins: AvroJava #352
Date Tue, 19 Feb 2013 07:39:41 GMT
See <https://builds.apache.org/job/AvroJava/352/changes>

Changes:

[cutting] AVRO-1215. Java: Fix AvroMultipleOutputs when specifying baseOutputPath.  Contributed
by Ashish Nagavaram.

------------------------------------------
[...truncated 2075 lines...]
[INFO] ------------------------------------------------------------------------
[INFO] 
[INFO] --- maven-plugin-plugin:2.9:helpmojo (generated-helpmojo) @ avro-maven-plugin ---
[INFO] Using 'UTF-8' encoding to read mojo metadata.
[INFO] Applying mojo extractor for language: java
[INFO] Mojo extractor for language: java found 3 mojo descriptors.
[INFO] Applying mojo extractor for language: bsh
[INFO] Mojo extractor for language: bsh found 0 mojo descriptors.
[INFO] 
[INFO] --- maven-plugin-plugin:2.9:descriptor (default-descriptor) @ avro-maven-plugin ---
[INFO] Using 'UTF-8' encoding to read mojo metadata.
[INFO] Applying mojo extractor for language: java
[INFO] Mojo extractor for language: java found 4 mojo descriptors.
[INFO] Applying mojo extractor for language: bsh
[INFO] Mojo extractor for language: bsh found 0 mojo descriptors.
[INFO] 
[INFO] --- maven-remote-resources-plugin:1.2.1:process (default) @ avro-maven-plugin ---
[INFO] 
[INFO] --- maven-resources-plugin:2.5:resources (default-resources) @ avro-maven-plugin ---
[debug] execute contextualize
[INFO] Using 'UTF-8' encoding to copy filtered resources.
[INFO] skip non existing resourceDirectory <https://builds.apache.org/job/AvroJava/ws/trunk/lang/java/maven-plugin/src/main/resources>
[INFO] Copying 3 resources
[INFO] 
[INFO] --- maven-compiler-plugin:2.3.2:compile (default-compile) @ avro-maven-plugin ---
[INFO] Compiling 5 source files to <https://builds.apache.org/job/AvroJava/ws/trunk/lang/java/maven-plugin/target/classes>
[INFO] 
[INFO] --- maven-resources-plugin:2.5:testResources (default-testResources) @ avro-maven-plugin
---
[debug] execute contextualize
[INFO] Using 'UTF-8' encoding to copy filtered resources.
[INFO] Copying 3 resources
[INFO] Copying 3 resources
[INFO] 
[INFO] --- maven-compiler-plugin:2.3.2:testCompile (default-testCompile) @ avro-maven-plugin
---
[INFO] Compiling 4 source files to <https://builds.apache.org/job/AvroJava/ws/trunk/lang/java/maven-plugin/target/test-classes>
[INFO] 
[INFO] --- maven-surefire-plugin:2.12:test (default-test) @ avro-maven-plugin ---
[INFO] Surefire report directory: <https://builds.apache.org/job/AvroJava/ws/trunk/lang/java/maven-plugin/target/surefire-reports>

-------------------------------------------------------
 T E S T S
-------------------------------------------------------

-------------------------------------------------------
 T E S T S
-------------------------------------------------------
Running org.apache.avro.mojo.TestIDLProtocolMojo
Tests run: 1, Failures: 0, Errors: 0, Skipped: 0, Time elapsed: 1.006 sec
Running org.apache.avro.mojo.TestSchemaMojo
Tests run: 1, Failures: 0, Errors: 0, Skipped: 0, Time elapsed: 1.047 sec
Running org.apache.avro.mojo.TestProtocolMojo
Tests run: 1, Failures: 0, Errors: 0, Skipped: 0, Time elapsed: 0.983 sec

Results :

Tests run: 3, Failures: 0, Errors: 0, Skipped: 0

[INFO] 
[INFO] --- maven-checkstyle-plugin:2.8:check (checkstyle-check) @ avro-maven-plugin ---
[INFO] Starting audit...
Audit done.

[INFO]                                                                         
[INFO] ------------------------------------------------------------------------
[INFO] Building Apache Avro IPC 1.7.4-SNAPSHOT
[INFO] ------------------------------------------------------------------------
[INFO] 
[INFO] --- avro-maven-plugin:1.7.4-SNAPSHOT:schema (schemas) @ avro-ipc ---
[INFO] 
[INFO] --- avro-maven-plugin:1.7.4-SNAPSHOT:protocol (schemas) @ avro-ipc ---
[INFO] 
[INFO] --- avro-maven-plugin:1.7.4-SNAPSHOT:idl-protocol (schemas) @ avro-ipc ---
[INFO] 
[INFO] --- maven-remote-resources-plugin:1.2.1:process (default) @ avro-ipc ---
[INFO] 
[INFO] --- maven-resources-plugin:2.5:resources (default-resources) @ avro-ipc ---
[debug] execute contextualize
[INFO] Using 'UTF-8' encoding to copy filtered resources.
[INFO] Copying 6 resources
[INFO] Copying 3 resources
[INFO] 
[INFO] --- maven-compiler-plugin:2.3.2:compile (default-compile) @ avro-ipc ---
[INFO] Compiling 57 source files to <https://builds.apache.org/job/AvroJava/ws/trunk/lang/java/ipc/target/classes>
[INFO] 
[INFO] --- maven-resources-plugin:2.5:testResources (default-testResources) @ avro-ipc ---
[debug] execute contextualize
[INFO] Using 'UTF-8' encoding to copy filtered resources.
[INFO] Copying 1 resource
[INFO] Copying 3 resources
[INFO] 
[INFO] --- maven-compiler-plugin:2.3.2:testCompile (default-testCompile) @ avro-ipc ---
[INFO] Compiling 82 source files to <https://builds.apache.org/job/AvroJava/ws/trunk/lang/java/ipc/target/test-classes>
[INFO] 
[INFO] --- maven-surefire-plugin:2.12:test (default-test) @ avro-ipc ---
[INFO] Surefire report directory: <https://builds.apache.org/job/AvroJava/ws/trunk/lang/java/ipc/target/surefire-reports>

-------------------------------------------------------
 T E S T S
-------------------------------------------------------

-------------------------------------------------------
 T E S T S
-------------------------------------------------------
Running org.apache.avro.compiler.specific.TestSpecificCompiler
Tests run: 16, Failures: 0, Errors: 0, Skipped: 0, Time elapsed: 3.508 sec
Running org.apache.avro.TestProtocolHttp
Tests run: 16, Failures: 0, Errors: 0, Skipped: 0, Time elapsed: 3.796 sec
Running org.apache.avro.TestProtocolGeneric
Tests run: 7, Failures: 0, Errors: 0, Skipped: 0, Time elapsed: 0.565 sec
Running org.apache.avro.TestProtocolParsing
Tests run: 4, Failures: 0, Errors: 0, Skipped: 0, Time elapsed: 0.342 sec
Running org.apache.avro.ipc.TestRpcPluginOrdering
Tests run: 1, Failures: 0, Errors: 0, Skipped: 0, Time elapsed: 0.427 sec
Running org.apache.avro.ipc.TestNettyServer
Tests run: 5, Failures: 1, Errors: 0, Skipped: 0, Time elapsed: 0.74 sec <<< FAILURE!
Running org.apache.avro.ipc.TestSaslDigestMd5
Tests run: 9, Failures: 0, Errors: 0, Skipped: 0, Time elapsed: 0.933 sec
Running org.apache.avro.ipc.TestNettyTransceiverWhenServerStops
Tests run: 1, Failures: 0, Errors: 0, Skipped: 0, Time elapsed: 5.253 sec
Running org.apache.avro.ipc.TestNettyServerWithCompression
Tests run: 5, Failures: 1, Errors: 0, Skipped: 0, Time elapsed: 0.635 sec <<< FAILURE!
Running org.apache.avro.ipc.trace.TestFileSpanStorage
Tests run: 4, Failures: 0, Errors: 0, Skipped: 0, Time elapsed: 18.259 sec
Running org.apache.avro.ipc.trace.TestStaticServlet
Tests run: 1, Failures: 0, Errors: 0, Skipped: 0, Time elapsed: 0.085 sec
Running org.apache.avro.ipc.trace.TestTraceSingletons
Tests run: 4, Failures: 0, Errors: 0, Skipped: 0, Time elapsed: 0.731 sec
Running org.apache.avro.ipc.trace.TestSpanAggregation
Tests run: 3, Failures: 0, Errors: 0, Skipped: 0, Time elapsed: 0.335 sec
Running org.apache.avro.ipc.trace.TestTraceCollection
Tests run: 1, Failures: 0, Errors: 0, Skipped: 0, Time elapsed: 1.516 sec
Running org.apache.avro.ipc.trace.TestTracingUtil
Tests run: 1, Failures: 0, Errors: 0, Skipped: 0, Time elapsed: 0.075 sec
Running org.apache.avro.ipc.trace.TestTraceConfigurations
Tests run: 1, Failures: 0, Errors: 0, Skipped: 0, Time elapsed: 0.058 sec
Running org.apache.avro.ipc.trace.TestEndToEndTracing
Tests run: 2, Failures: 0, Errors: 0, Skipped: 0, Time elapsed: 3.833 sec
Running org.apache.avro.ipc.trace.TestBasicTracing
Tests run: 2, Failures: 0, Errors: 0, Skipped: 0, Time elapsed: 0.9 sec
Running org.apache.avro.ipc.trace.TestSpanTraceFormation
Tests run: 4, Failures: 0, Errors: 0, Skipped: 0, Time elapsed: 0.363 sec
Running org.apache.avro.ipc.TestNettyServerWithSSL
Tests run: 5, Failures: 0, Errors: 0, Skipped: 0, Time elapsed: 0.652 sec
Running org.apache.avro.ipc.TestSaslAnonymous
Tests run: 8, Failures: 0, Errors: 0, Skipped: 0, Time elapsed: 0.539 sec
Running org.apache.avro.ipc.stats.TestStopwatch
Tests run: 6, Failures: 0, Errors: 0, Skipped: 0, Time elapsed: 0.061 sec
Running org.apache.avro.ipc.stats.TestHistogram
Tests run: 3, Failures: 0, Errors: 0, Skipped: 0, Time elapsed: 0.067 sec
Running org.apache.avro.ipc.stats.TestStatsPluginAndServlet
Tests run: 3, Failures: 0, Errors: 0, Skipped: 0, Time elapsed: 0.759 sec
Running org.apache.avro.ipc.TestNettyServerConcurrentExecution
Tests run: 1, Failures: 0, Errors: 0, Skipped: 0, Time elapsed: 0.641 sec
547 [pool-3-thread-3] INFO org.apache.avro.ipc.NettyServer - Connection to /67.195.138.61:36825
disconnected.
Running org.apache.avro.ipc.TestNettyServerWithCallbacks
Tests run: 11, Failures: 0, Errors: 0, Skipped: 1, Time elapsed: 5.743 sec
Running org.apache.avro.ipc.TestLocalTransceiver
Tests run: 1, Failures: 0, Errors: 0, Skipped: 0, Time elapsed: 0.452 sec
Running org.apache.avro.TestProtocolSpecific
Tests run: 14, Failures: 0, Errors: 0, Skipped: 0, Time elapsed: 1.261 sec
1164 [SocketServer on 0.0.0.0/0.0.0.0:0] INFO org.apache.avro.ipc.SocketServer - stopping
/0:0:0:0:0:0:0:0
Running org.apache.avro.TestSchema
Tests run: 47, Failures: 0, Errors: 0, Skipped: 0, Time elapsed: 6.773 sec
Running org.apache.avro.specific.TestSpecificDatumWriter
Tests run: 1, Failures: 0, Errors: 0, Skipped: 0, Time elapsed: 0.388 sec
Running org.apache.avro.specific.TestSpecificErrorBuilder
Tests run: 2, Failures: 0, Errors: 0, Skipped: 0, Time elapsed: 0.447 sec
Running org.apache.avro.specific.TestSpecificRecordBuilder
Tests run: 10, Failures: 0, Errors: 0, Skipped: 3, Time elapsed: 0.392 sec
Running org.apache.avro.specific.TestSpecificData
Tests run: 5, Failures: 0, Errors: 0, Skipped: 0, Time elapsed: 0.42 sec
Running org.apache.avro.TestBulkData
Tests run: 2, Failures: 0, Errors: 0, Skipped: 0, Time elapsed: 0.831 sec
Running org.apache.avro.TestCompare
Tests run: 14, Failures: 0, Errors: 0, Skipped: 0, Time elapsed: 0.388 sec
Running org.apache.avro.TestProtocolNetty
Tests run: 14, Failures: 0, Errors: 0, Skipped: 0, Time elapsed: 1.512 sec
Running org.apache.avro.TestProtocolDatagram
Tests run: 14, Failures: 0, Errors: 0, Skipped: 0, Time elapsed: 1.661 sec
Running org.apache.avro.TestProtocolSpecificMeta
Tests run: 14, Failures: 0, Errors: 0, Skipped: 0, Time elapsed: 1.336 sec
Running org.apache.avro.TestNamespaceReflect
Tests run: 2, Failures: 0, Errors: 0, Skipped: 0, Time elapsed: 0.536 sec
Running org.apache.avro.TestNamespaceSpecific
Tests run: 2, Failures: 0, Errors: 0, Skipped: 0, Time elapsed: 0.567 sec
467 [SocketServer on 0.0.0.0/0.0.0.0:0] INFO org.apache.avro.ipc.SocketServer - stopping /0:0:0:0:0:0:0:0
Running org.apache.avro.generic.TestDeepCopy
Tests run: 1, Failures: 0, Errors: 0, Skipped: 0, Time elapsed: 0.345 sec
Running org.apache.avro.TestDataFileSpecific
Tests run: 1, Failures: 0, Errors: 0, Skipped: 0, Time elapsed: 0.371 sec
Running org.apache.avro.TestProtocolHttps
Tests run: 14, Failures: 0, Errors: 0, Skipped: 0, Time elapsed: 2.681 sec
Running org.apache.avro.TestProtocolReflect
Tests run: 7, Failures: 0, Errors: 0, Skipped: 0, Time elapsed: 0.462 sec
Running org.apache.avro.TestProtocolReflectMeta
Tests run: 7, Failures: 0, Errors: 0, Skipped: 0, Time elapsed: 0.46 sec
Running org.apache.avro.TestProtocolGenericMeta
Tests run: 7, Failures: 0, Errors: 0, Skipped: 0, Time elapsed: 0.49 sec

Results :

Failed tests:   testConnectionsCount(org.apache.avro.ipc.TestNettyServer): expected:<1>
but was:<2>
  testConnectionsCount(org.apache.avro.ipc.TestNettyServerWithCompression): expected:<1>
but was:<2>

Tests run: 303, Failures: 2, Errors: 0, Skipped: 4

[INFO] ------------------------------------------------------------------------
[INFO] Reactor Summary:
[INFO] 
[INFO] Apache Avro Toplevel .............................. SUCCESS [3.507s]
[INFO] Apache Avro Java .................................. SUCCESS [10.422s]
[INFO] Apache Avro ....................................... SUCCESS [54.374s]
[INFO] Apache Avro Compiler .............................. SUCCESS [7.654s]
[INFO] Apache Avro Maven Plugin .......................... SUCCESS [12.725s]
[INFO] Apache Avro IPC ................................... FAILURE [1:33.085s]
[INFO] Trevni Java ....................................... SKIPPED
[INFO] Trevni Java Core .................................. SKIPPED
[INFO] Apache Avro Mapred API ............................ SKIPPED
[INFO] Trevni Java Avro .................................. SKIPPED
[INFO] Trevni Specification .............................. SKIPPED
[INFO] Apache Avro Tools ................................. SKIPPED
[INFO] Apache Avro Protobuf Compatibility ................ SKIPPED
[INFO] Apache Avro Thrift Compatibility .................. SKIPPED
[INFO] Apache Avro Maven Archetypes ...................... SKIPPED
[INFO] Apache Avro Maven Service Archetype ............... SKIPPED
[INFO] ------------------------------------------------------------------------
[INFO] BUILD FAILURE
[INFO] ------------------------------------------------------------------------
[INFO] Total time: 3:07.183s
[INFO] Finished at: Tue Feb 19 07:39:35 UTC 2013
[INFO] Final Memory: 47M/246M
[INFO] ------------------------------------------------------------------------
[ERROR] Failed to execute goal org.apache.maven.plugins:maven-surefire-plugin:2.12:test (default-test)
on project avro-ipc: There are test failures.
[ERROR] 
[ERROR] Please refer to <https://builds.apache.org/job/AvroJava/ws/trunk/lang/java/ipc/target/surefire-reports>
for the individual test results.
[ERROR] -> [Help 1]
[ERROR] 
[ERROR] To see the full stack trace of the errors, re-run Maven with the -e switch.
[ERROR] Re-run Maven using the -X switch to enable full debug logging.
[ERROR] 
[ERROR] For more information about the errors and possible solutions, please read the following
articles:
[ERROR] [Help 1] http://cwiki.apache.org/confluence/display/MAVEN/MojoFailureException
[ERROR] 
[ERROR] After correcting the problems, you can resume the build with the command
[ERROR]   mvn <goals> -rf :avro-ipc
Build step 'Invoke top-level Maven targets' marked build as failure
[WARNINGS] Skipping publisher since build result is FAILURE
Recording test results
Updating AVRO-1215

Mime
View raw message