avro-dev mailing list archives

Site index · List index
Message view « Date » · « Thread »
Top « Date » · « Thread »
From Apache Jenkins Server <jenk...@builds.apache.org>
Subject Build failed in Jenkins: AvroJava #131
Date Mon, 12 Sep 2011 20:58:37 GMT
See <https://builds.apache.org/job/AvroJava/131/changes>

Changes:

[cutting] AVRO-805: Java: Add support for reading and writing instances of Protocol Buffer
(protobuf) generated classes.

------------------------------------------
[...truncated 1053 lines...]
314008/?
314520/?
315032/?
315544/?
316056/?
316568/?
317201/?
317713/?
318225/?
318513/?
318537/?
319048/?
319560/?
320072/?
320584/?
321097/?
321628/?
322134/?
322645/?
323235/?
323746/?
324257/?
324769/?
325281/?
325870/?
326447/?
327118/?
327630/?
328142/?
328745/?
329256/?
329768/?
330279/?
330889/?
331400/?
332003/?
332515/?
333117/?
333629/?
334140/?
334752/?
335266/?
335847/?
336359/?
336871/?
337449/?
338028/?
338539/?
339051/?
339509/?
339996/?
340020/?
340584/?
341096/?
341608/?
342120/?
342631/?
343143/?
343654/?
344217/?
344791/?
345375/?
345887/?
346398/?
346910/?
347422/?
347933/?
348449/?
348960/?
349558/?
350070/?
350582/?
351170/?
351681/?
352194/?
352792/?
353376/?
353888/?
354471/?
354983/?
355495/?
356064/?
356521/?
357089/?
357601/?
358115/?
358719/?
359274/?
359785/?
360339/?
360882/?
361397/?
361908/?
362085/?
362646/?
363204/?
363759/?
364326/?
364941/?
365505/?
366121/?
366632/?
367222/?
367824/?
368340/?
368911/?
369423/?
369934/?
370445/?
370956/?
371468/?
371981/?
372570/?
373165/?
373676/?
374234/?
374741/?
375294/?
375806/?
376406/?
376962/?
377473/?
377984/?
378536/?
379048/?
379612/?
380188/?
380759/?
381324/?
381835/?
382347/?
382917/?
383429/?
384000/?
384511/?
385074/?
385586/?
386098/?
386609/?
387120/?
387431/?
387455/?
387967/?
388515/?
389027/?
389661/?
390220/?
390732/?
391244/?
391713/?
392213/?
392727/?
393251/?
393803/?
394315/?
394874/?
395386/?
395899/?
396411/?
396922/?
397434/?
397946/?
398501/?
399013/?
399525/?
400037/?
400549/?
401061/?
401573/?
402085/?
402596/?
403109/?
403621/?
404132/?
404644/?
405156/?
405711/?
406223/?
406735/?
407349/?
407861/?
408348/?
408372/?
408822/?
409334/?
409845/?
410356/?
410868/?
411392/?
411955/?
412473/?
413039/?
413551/?
414066/?
414578/?
415090/?
415653/?
416164/?
416675/?
417187/?
417699/?
418250/?
418761/?
419339/?
419849/?
420422/?
420974/?
421609/?
422209/?
422828/?
423401/?
423912/?
424425/?
424989/?
425500/?
425965/?
426459/?
427148/?
427642/?
428134/?
429098/?
431136/?
434037/?
436828/?
439326/?
441530/?
444266/?
446341/?
448428/?
450279/?
        
[INFO] [antrun:run {execution: generate-test-sources}]
[INFO] Executing tasks
    [mkdir] Created dir: <https://builds.apache.org/job/AvroJava/ws/trunk/lang/java/protobuf/target/generated-test-sources>
[INFO] ------------------------------------------------------------------------
[ERROR] BUILD ERROR
[INFO] ------------------------------------------------------------------------
[INFO] An Ant BuildException has occured: Execute failed: java.io.IOException: Cannot run
program "protoc" (in directory "<https://builds.apache.org/job/AvroJava/ws/trunk/lang/java/protobuf")>:
java.io.IOException: error=2, No such file or directory

[INFO] ------------------------------------------------------------------------
[INFO] For more information, run Maven with the -e switch
[INFO] ------------------------------------------------------------------------
[INFO] Total time: 2 minutes 15 seconds
[INFO] Finished at: Mon Sep 12 20:58:28 UTC 2011
[INFO] Final Memory: 85M/439M
[INFO] ------------------------------------------------------------------------
Build step 'Invoke top-level Maven targets' marked build as failure
[WARNINGS] Skipping publisher since build result is FAILURE
Recording test results


Mime
View raw message