avalon-dev mailing list archives

Site index · List index
Message view « Date » · « Thread »
Top « Date » · « Thread »
From Niclas Hedhman <nic...@hedhman.org>
Subject Build error....
Date Wed, 10 Dec 2003 10:26:19 GMT

Stephen,

this one I can't figure out...


     [exec]     [junit] Running 
org.apache.avalon.merlin.unit.test.MerlinTestCaseTest
     [exec] ---- exception report 
----------------------------------------------------------
     [exec] Exception: org.apache.avalon.repository.RepositoryException
     [exec] Message: Unable to establish a factory for the supplied artifact:
     [exec]  artifact: [jar: avalon-repository:avalon-repository-impl;1.2-dev]
     [exec]  build: 20031210.075147
     [exec]  factory: org.apache.avalon.repository.impl.DefaultFactory
     [exec]  source: file:/java/maven/lib/ant-1.5.3-1.jar
     [exec]  cache: /java/maven/repository
     [exec] ---- cause 
---------------------------------------------------------------------
     [exec] Exception: java.lang.NoClassDefFoundError
     [exec] Message: org/apache/avalon/defaults/Defaults
     [exec] ---- stack trace 
---------------------------------------------------------------
     [exec] java.lang.NoClassDefFoundError: 
org/apache/avalon/defaults/Defaults
     [exec] BUILD FAILED
     [exec] File...... file:/home/niclas/dev/opensource/avalon/merlin/
     [exec] Element... maven:reactor
     [exec] Line...... 81
     [exec] Column.... 32
     [exec] Unable to obtain goal [test:test] -- 
file:/home/niclas/.maven/plugins/maven-test-plugin-1.4-SNAPSHOT/:123:54: 
<fail> There were test failures.
     [exec] java.lang.Class.getDeclaredConstructors0(Native Method)
     [exec] java.lang.Class.privateGetDeclaredConstructors(Class.java:1610)
     [exec] java.lang.Class.getConstructor0(Class.java:1922)
     [exec] java.lang.Class.getConstructor(Class.java:1019)
     [exec] 
org.apache.avalon.repository.main.AbstractBuilder.createDelegate(AbstractBuilder.java:140)
     [exec] 
org.apache.avalon.repository.main.DefaultInitialContext.<init>(DefaultInitialContext.java:298)
     [exec] 
org.apache.avalon.repository.main.DefaultInitialContext.<init>(DefaultInitialContext.java:219)
     [exec] 
org.apache.avalon.repository.main.DefaultInitialContext.<init>(DefaultInitialContext.java:204)
     [exec] 
org.apache.avalon.repository.main.DefaultInitialContext.<init>(DefaultInitialContext.java:179)
     [exec] 
org.apache.avalon.merlin.unit.AbstractMerlinTestCase.setUp(AbstractMerlinTestCase.java:127)
     [exec] junit.framework.TestCase.runBare(TestCase.java:125)
     [exec] junit.framework.TestResult$1.protect(TestResult.java:106)
     [exec] junit.framework.TestResult.runProtected(TestResult.java:124)
     [exec] junit.framework.TestResult.run(TestResult.java:109)
     [exec] junit.framework.TestCase.run(TestCase.java:118)
     [exec] junit.framework.TestSuite.runTest(TestSuite.java:208)
     [exec] junit.framework.TestSuite.run(TestSuite.java:203)


---------------------------------------------------------------------
To unsubscribe, e-mail: dev-unsubscribe@avalon.apache.org
For additional commands, e-mail: dev-help@avalon.apache.org


Mime
View raw message