avalon-dev mailing list archives

Site index · List index
Message view « Date » · « Thread »
Top « Date » · « Thread »
From "Carsten Ziegeler" <cziege...@s-und-n.de>
Subject Problems building Merlin
Date Wed, 30 Jul 2003 13:56:46 GMT
I just tried to build merlin via maven with the "maven dist"
command. I get an error in the junit tests:

test:test:
    [junit] dir attribute ignored if running in the same VM
    [junit] Running org.apache.avalon.merlin.jmx.ClientTestCase
[INFO] setup
[INFO] starting mbean server
[INFO] adding JRMP adapter
[INFO] declaring JRMP adapter to JNDI
    [junit] Tests run: 1, Failures: 0, Errors: 1, Time elapsed: 0,451 sec
    [junit] [ERROR] TEST org.apache.avalon.merlin.jmx.ClientTestCase FAILED

BUILD FAILED


Carsten 


---------------------------------------------------------------------
To unsubscribe, e-mail: dev-unsubscribe@avalon.apache.org
For additional commands, e-mail: dev-help@avalon.apache.org


Mime
View raw message