avalon-dev mailing list archives

Site index · List index
Message view « Date » · « Thread »
Top « Date » · « Thread »
From Gump Integration Build <...@avalon.apache.org>
Subject [GUMP] Build Failure - dist-avalon-excalibur
Date Tue, 06 May 2003 09:33:47 GMT
----------------------------------------------------
This email is autogenerated from the output from:
<http://cvs.apache.org/builds/gump/2003-05-06/dist-avalon-excalibur.html>
----------------------------------------------------

Buildfile: build.xml

jar:

prj-compatibility:

dependencies:

compile:

prepare-conf:

jar:
      [jar] Building jar: /home/rubys/jakarta/avalon-excalibur/compatibility/build/lib/excalibur-compatibility-1.1.jar

dist-jar:
     [copy] Copying 1 file to /home/rubys/jakarta/avalon-excalibur/compatibility/dist

prj-i18n:

dependencies:

compile:

prepare-conf:

jar:
      [jar] Building jar: /home/rubys/jakarta/avalon-excalibur/i18n/build/lib/excalibur-i18n-1.0.jar

dist-jar:
     [copy] Copying 1 file to /home/rubys/jakarta/avalon-excalibur/i18n/dist

prj-extension:

dependencies:

compile:

prepare-conf:

jar:
      [jar] Building jar: /home/rubys/jakarta/avalon-excalibur/extension/build/lib/excalibur-extension-1.0a.jar

dist-jar:
     [copy] Copying 1 file to /home/rubys/jakarta/avalon-excalibur/extension/dist

prj-configuration:

dependencies:

compile:

prepare-conf:

jar:
      [jar] Building jar: /home/rubys/jakarta/avalon-excalibur/configuration/build/lib/excalibur-configuration-1.0.jar

dist-jar:
     [copy] Copying 1 file to /home/rubys/jakarta/avalon-excalibur/configuration/dist

prj-event:

dependencies:

compile:

prepare-conf:

jar:
      [jar] Building jar: /home/rubys/jakarta/avalon-excalibur/event/build/lib/excalibur-event-1.0.2.jar

dist-jar:
     [copy] Copying 1 file to /home/rubys/jakarta/avalon-excalibur/event/dist
     [copy] Copying 1 file to /home/rubys/jakarta/avalon-excalibur/event/dist/lib
     [copy] Copying 1 file to /home/rubys/jakarta/avalon-excalibur/event/dist/lib

prj-instrument:
Caught exception (org.apache.tools.ant.BuildException) while expanding tools.class.path: /home/rubys/jakarta/avalon/tools/lib
not found.

dependencies:

check-environment:

framework-warning:

compile:

prepare-conf:

jar:
      [jar] Building jar: /home/rubys/jakarta/avalon-excalibur/instrument/build/lib/excalibur-instrument-1.0.jar

dist-jar:
     [copy] Copying 1 file to /home/rubys/jakarta/avalon-excalibur/instrument/dist

prj-pool:
Caught exception (org.apache.tools.ant.BuildException) while expanding tools.class.path: /home/rubys/jakarta/avalon/tools/lib
not found.

dependencies:

compile:

prepare-conf:

jar:
      [jar] Building jar: /home/rubys/jakarta/avalon-excalibur/pool/build/lib/excalibur-pool-1.2.jar

dist-jar:
    [mkdir] Created dir: /home/rubys/jakarta/avalon-excalibur/pool/dist
     [copy] Copying 2 files to /home/rubys/jakarta/avalon-excalibur/pool/dist

prj-thread:
Caught exception (org.apache.tools.ant.BuildException) while expanding tools.class.path: /home/rubys/jakarta/avalon/tools/lib
not found.

dependencies:

compile:

prepare-conf:

jar:
      [jar] Building jar: /home/rubys/jakarta/avalon-excalibur/thread/build/lib/excalibur-thread-1.1.1.jar

dist-jar:
    [mkdir] Created dir: /home/rubys/jakarta/avalon-excalibur/thread/dist
     [copy] Copying 2 files to /home/rubys/jakarta/avalon-excalibur/thread/dist

prj-logger:

check-environment:

dependencies.servlet:

checkRequiredClass:

checkRequiredClass.fail:

dependencies.datasource:

checkRequiredClass:

checkRequiredClass.fail:

dependencies.jms:

dependencies.optional:

dependencies:

jms-warn:

op-warning:
     [echo] **********************************************
     [echo] *
     [echo] *  Classes needed for output via JMS are not 
     [echo] *  available.  Excalibur Logger should build without them
     [echo] *
     [echo] *  Recovery:
     [echo] *  Get jms.jar from inside jms-1_0_2b.zip from http://java.sun.com/products/jms/docs.html
and place it in /home/rubys/jakarta/avalon-excalibur/logger/../lib (if defined), or set the
${jms.jar} property in ant.properties
     [echo] *
     [echo] ***********************************************


sql-warn:

mail-warn:

op-warning:
     [echo] **********************************************
     [echo] *
     [echo] *  Classes needed for output via SMTP are not 
     [echo] *  available.  Excalibur Logger should build without them
     [echo] *
     [echo] *  Recovery:
     [echo] *  Get mail.jar from inside javamail-1_2.zip from http://java.sun.com/products/javamail/
and place it in /home/rubys/jakarta/avalon-excalibur/logger/../lib (if defined), or set the
${mail.jar} property in ant.properties
     [echo] *
     [echo] ***********************************************


log4j-warn:

servlet-warn:

lf5-warn:

optional-warnings:

compile:

prepare-conf:

jar:
      [jar] Building jar: /home/rubys/jakarta/avalon-excalibur/logger/build/lib/excalibur-logger-1.0.1.jar

dist-jar:
    [mkdir] Created dir: /home/rubys/jakarta/avalon-excalibur/logger/dist
     [copy] Copying 2 files to /home/rubys/jakarta/avalon-excalibur/logger/dist

prj-sourceresolve:
Caught exception (org.apache.tools.ant.BuildException) while expanding tools.class.path: /home/rubys/jakarta/avalon/tools/lib
not found.

dependencies:

compile:

prepare-conf:

jar:
      [jar] Building jar: /home/rubys/jakarta/avalon-excalibur/sourceresolve/build/lib/excalibur-sourceresolve-1.0.jar

dist-jar:
     [copy] Copying 1 file to /home/rubys/jakarta/avalon-excalibur/sourceresolve/dist

prj-monitor:
Caught exception (org.apache.tools.ant.BuildException) while expanding tools.class.path: /home/rubys/jakarta/avalon/tools/lib
not found.

dependencies:

compile:

prepare-conf:

jar:
      [jar] Building jar: /home/rubys/jakarta/avalon-excalibur/monitor/build/lib/excalibur-monitor-1.0.1.jar

dist-jar:
     [copy] Copying 1 file to /home/rubys/jakarta/avalon-excalibur/monitor/dist

prj-lifecycle:

dependencies:

check-environment:

framework-warning:

compile:

prepare-conf:

jar:
      [jar] Building jar: /home/rubys/jakarta/avalon-excalibur/lifecycle/build/lib/excalibur-lifecycle-1.0.jar

dist-jar:
     [copy] Copying 1 file to /home/rubys/jakarta/avalon-excalibur/lifecycle/dist

prj-instrument-manager:

dependencies:

compile:
    [javac] Compiling 2 source files to /home/rubys/jakarta/avalon-excalibur/instrument-manager/build/classes

prepare-conf:

jar:
      [jar] Building jar: /home/rubys/jakarta/avalon-excalibur/instrument-manager/build/lib/excalibur-instrument-manager-1.0.jar
      [jar] Building jar: /home/rubys/jakarta/avalon-excalibur/instrument-manager/build/lib/excalibur-instrument-manager-interfaces-1.0.jar

dist-jar:
    [mkdir] Created dir: /home/rubys/jakarta/avalon-excalibur/instrument-manager/dist
     [copy] Copying 4 files to /home/rubys/jakarta/avalon-excalibur/instrument-manager/dist

prj-fortress:

checkBCEL:

dependencies:

compile:

prepare-conf:

jar:
      [jar] Building jar: /home/rubys/jakarta/avalon-excalibur/fortress/build/lib/excalibur-fortress-1.0.jar

big-jar:
      [jar] Building jar: /home/rubys/jakarta/avalon-excalibur/fortress/build/lib/excalibur-fortress-complete-1.0.jar
      [jar] META-INF/LICENSE.txt already added, skipping
      [jar] META-INF/LICENSE.txt already added, skipping
      [jar] META-INF/LICENSE.txt already added, skipping
      [jar] META-INF/LICENSE.txt already added, skipping
      [jar] META-INF/LICENSE.txt already added, skipping
      [jar] META-INF/LICENSE.txt already added, skipping
      [jar] META-INF/LICENSE.txt already added, skipping
      [jar] META-INF/LICENSE.txt already added, skipping

compile-tools:

tools-jar:
      [jar] Building jar: /home/rubys/jakarta/avalon-excalibur/fortress/build/lib/excalibur-fortress-tools-1.0.jar

dist-jar:
     [copy] Copying 3 files to /home/rubys/jakarta/avalon-excalibur/fortress/dist

prj-datasource:
Caught exception (org.apache.tools.ant.BuildException) while expanding tools.class.path: /home/rubys/jakarta/avalon/tools/lib
not found.

check-environment:

check-datasource:

filter-jdbc:

nofilter-jdbc:

prepare-jdbc:

prepare:

dependencies:

compile:

prepare-conf:

jar:
      [jar] Building jar: /home/rubys/jakarta/avalon-excalibur/datasource/build/lib/excalibur-datasource-1.1.1.jar
      [jar] Building jar: /home/rubys/jakarta/avalon-excalibur/datasource/build/lib/excalibur-datasource-cluster-1.1.1a.jar
      [jar] Building jar: /home/rubys/jakarta/avalon-excalibur/datasource/build/lib/excalibur-datasource-ids-1.1.1a.jar

dist-jar:
    [mkdir] Created dir: /home/rubys/jakarta/avalon-excalibur/datasource/dist
     [copy] Copying 6 files to /home/rubys/jakarta/avalon-excalibur/datasource/dist

prj-store:
Caught exception (org.apache.tools.ant.BuildException) while expanding tools.class.path: /home/rubys/jakarta/avalon/tools/lib
not found.

dependencies:

compile:

prepare-conf:

jar:
      [jar] Building jar: /home/rubys/jakarta/avalon-excalibur/store/build/lib/excalibur-store-1.0.jar

dist-jar:
     [copy] Copying 1 file to /home/rubys/jakarta/avalon-excalibur/store/dist

prj-component:

check-environment:

dependencies.servlet:

checkRequiredClass:

checkRequiredClass.fail:

dependencies.optional:

dependencies:

servlet-warn:

compile:

prepare-conf:

jar-servlet:
      [jar] Building jar: /home/rubys/jakarta/avalon-excalibur/component/build/lib/excalibur-component-servlet-1.1.jar

jar-testcase:
      [jar] Building jar: /home/rubys/jakarta/avalon-excalibur/component/build/lib/excalibur-testcase-1.1.jar

jar:
      [jar] Building jar: /home/rubys/jakarta/avalon-excalibur/component/build/lib/excalibur-component-1.1.jar

big-jar:
     [copy] Copying 1 file to /home/rubys/jakarta/avalon-excalibur/component/build/tempjars
     [copy] Copying 1 file to /home/rubys/jakarta/avalon-excalibur/component/build/tempjars
     [copy] Copying 1 file to /home/rubys/jakarta/avalon-excalibur/component/build/tempjars
     [copy] Copying 1 file to /home/rubys/jakarta/avalon-excalibur/component/build/tempjars
     [copy] Copying 1 file to /home/rubys/jakarta/avalon-excalibur/component/build/tempjars
     [copy] Copying 1 file to /home/rubys/jakarta/avalon-excalibur/component/build/tempjars
     [copy] Copying 1 file to /home/rubys/jakarta/avalon-excalibur/component/build/tempjars
      [jar] Building jar: /home/rubys/jakarta/avalon-excalibur/component/build/lib/excalibur-component-complete-1.1.jar
      [jar] META-INF/LICENSE.txt already added, skipping
      [jar] META-INF/LICENSE.txt already added, skipping
      [jar] META-INF/LICENSE.txt already added, skipping
      [jar] META-INF/LICENSE.txt already added, skipping
      [jar] META-INF/LICENSE.txt already added, skipping
      [jar] META-INF/LICENSE.txt already added, skipping
      [jar] META-INF/LICENSE.txt already added, skipping
      [jar] org/apache/avalon/excalibur/i18n/Resources.class already added, skipping
      [jar] org/apache/avalon/excalibur/i18n/ResourceManager.class already added, skipping
      [jar] org/apache/excalibur/instrument/CounterInstrument.class already added, skipping
      [jar] org/apache/excalibur/instrument/Instrument.class already added, skipping
      [jar] org/apache/excalibur/instrument/InstrumentProxy.class already added, skipping
      [jar] org/apache/excalibur/instrument/NoopInstrumentManager.class already added, skipping
      [jar] org/apache/excalibur/instrument/AbstractLogEnabledInstrumentable.class already
added, skipping
      [jar] org/apache/excalibur/instrument/Instrumentable.class already added, skipping
      [jar] org/apache/excalibur/instrument/AbstractInstrumentable.class already added, skipping
      [jar] org/apache/excalibur/instrument/AbstractInstrument.class already added, skipping
      [jar] org/apache/excalibur/instrument/ValueInstrument.class already added, skipping
      [jar] org/apache/excalibur/instrument/InstrumentManager.class already added, skipping
      [jar] org/apache/excalibur/instrument/InstrumentManageable.class already added, skipping
      [jar] org/apache/excalibur/instrument/InstrumentManager$1.class already added, skipping
      [jar] META-INF/LICENSE.txt already added, skipping
      [jar] org/apache/excalibur/instrument/manager/AbstractValueInstrumentSample.class already
added, skipping
      [jar] org/apache/excalibur/instrument/manager/CounterInstrumentListener.class already
added, skipping
      [jar] org/apache/excalibur/instrument/manager/InstrumentSample.class already added,
skipping
      [jar] org/apache/excalibur/instrument/manager/MinimumValueInstrumentSample.class already
added, skipping
      [jar] org/apache/excalibur/instrument/manager/InstrumentableProxy.class already added,
skipping
      [jar] org/apache/excalibur/instrument/manager/InstrumentManagerConnector.class already
added, skipping
      [jar] org/apache/excalibur/instrument/manager/InstrumentSampleFactory.class already
added, skipping
      [jar] org/apache/excalibur/instrument/manager/ValueInstrumentListener.class already
added, skipping
      [jar] org/apache/excalibur/instrument/manager/InstrumentManagerClientLocalImpl.class
already added, skipping
      [jar] org/apache/excalibur/instrument/manager/InstrumentableProxy$1.class already added,
skipping
      [jar] org/apache/excalibur/instrument/manager/InstrumentableProxy$2.class already added,
skipping
      [jar] org/apache/excalibur/instrument/manager/MeanValueInstrumentSample.class already
added, skipping
      [jar] org/apache/excalibur/instrument/manager/InstrumentProxy.class already added, skipping
      [jar] org/apache/excalibur/instrument/manager/InstrumentableDescriptorLocalImpl.class
already added, skipping
      [jar] org/apache/excalibur/instrument/manager/InstrumentListener.class already added,
skipping
      [jar] org/apache/excalibur/instrument/manager/NoopInstrumentManager.class already added,
skipping
      [jar] org/apache/excalibur/instrument/manager/CounterInstrumentSample.class already
added, skipping
      [jar] org/apache/excalibur/instrument/manager/InstrumentManagerClientLocal.class already
added, skipping
      [jar] org/apache/excalibur/instrument/manager/DefaultInstrumentManager.class already
added, skipping
      [jar] org/apache/excalibur/instrument/manager/AbstractInstrumentSample.class already
added, skipping
      [jar] org/apache/excalibur/instrument/manager/InstrumentDescriptorLocal.class already
added, skipping
      [jar] org/apache/excalibur/instrument/manager/InstrumentSampleListener.class already
added, skipping
      [jar] org/apache/excalibur/instrument/manager/DefaultInstrumentManager$1.class already
added, skipping
      [jar] org/apache/excalibur/instrument/manager/InstrumentProxy$1.class already added,
skipping
      [jar] org/apache/excalibur/instrument/manager/MaximumValueInstrumentSample.class already
added, skipping
      [jar] org/apache/excalibur/instrument/manager/InstrumentableDescriptorLocal.class already
added, skipping
      [jar] org/apache/excalibur/instrument/manager/InstrumentDescriptorLocalImpl.class already
added, skipping
      [jar] org/apache/excalibur/instrument/manager/InstrumentSampleDescriptorLocal.class
already added, skipping
      [jar] META-INF/LICENSE.txt already added, skipping
      [jar] org/apache/excalibur/instrument/manager/InstrumentSampleDescriptorLocalImpl.class
already added, skipping
      [jar] org/apache/excalibur/instrument/manager/interfaces/InstrumentSampleUtils.class
already added, skipping
      [jar] org/apache/excalibur/instrument/manager/interfaces/InstrumentSampleSnapshot.class
already added, skipping
      [jar] org/apache/excalibur/instrument/manager/interfaces/InstrumentSampleDescriptor.class
already added, skipping
      [jar] org/apache/excalibur/instrument/manager/interfaces/NoSuchInstrumentSampleException.class
already added, skipping
      [jar] org/apache/excalibur/instrument/manager/interfaces/NoSuchInstrumentException.class
already added, skipping
      [jar] org/apache/excalibur/instrument/manager/interfaces/InstrumentManagerClient.class
already added, skipping
      [jar] org/apache/excalibur/instrument/manager/interfaces/NoSuchInstrumentableException.class
already added, skipping
      [jar] org/apache/excalibur/instrument/manager/interfaces/InstrumentDescriptor.class
already added, skipping
      [jar] META-INF/LICENSE.txt already added, skipping
      [jar] org/apache/excalibur/instrument/manager/interfaces/InstrumentableDescriptor.class
already added, skipping
      [jar] org/apache/avalon/excalibur/logger/DefaultLoggerManager.class already added, skipping
      [jar] org/apache/avalon/excalibur/logger/DefaultLogKitManager.class already added, skipping
      [jar] org/apache/avalon/excalibur/logger/factory/PriorityFilterTargetFactory.class already
added, skipping
      [jar] org/apache/avalon/excalibur/logger/factory/AsyncLogTargetFactory.class already
added, skipping
      [jar] org/apache/avalon/excalibur/logger/LogKitManager.class already added, skipping
      [jar] org/apache/avalon/excalibur/logger/LoggerManager.class already added, skipping
      [jar] org/apache/avalon/excalibur/logger/factory/JDBCTargetFactory.class already added,
skipping
      [jar] org/apache/avalon/excalibur/logger/factory/ServletTargetFactory.class already
added, skipping
      [jar] org/apache/avalon/excalibur/logger/factory/SMTPTargetFactory.class already added,
skipping
      [jar] org/apache/avalon/excalibur/logger/LogTargetFactoryManager.class already added,
skipping
      [jar] org/apache/avalon/excalibur/logger/Log4JLoggerManager.class already added, skipping
      [jar] org/apache/avalon/excalibur/logger/LoggerManager$1.class already added, skipping
      [jar] org/apache/avalon/excalibur/logger/factory/LF5TargetFactory.class already added,
skipping
      [jar] org/apache/avalon/excalibur/logger/factory/DatagramTargetFactory.class already
added, skipping
      [jar] org/apache/avalon/excalibur/logger/SimpleLogKitManager.class already added, skipping
      [jar] org/apache/avalon/excalibur/logger/Resources.properties already added, skipping
      [jar] org/apache/avalon/excalibur/logger/factory/StreamTargetFactory.class already added,
skipping
      [jar] org/apache/avalon/excalibur/logger/DefaultLogTargetFactoryManager.class already
added, skipping
      [jar] org/apache/avalon/excalibur/logger/LogTargetFactory.class already added, skipping
      [jar] org/apache/avalon/excalibur/logger/LoggerLoggerManager.class already added, skipping
      [jar] org/apache/avalon/excalibur/logger/Log4JConfLoggerManager.class already added,
skipping
      [jar] org/apache/avalon/excalibur/logger/LogKitManageable.class already added, skipping
      [jar] org/apache/avalon/excalibur/logger/LogTargetFactoryManageable.class already added,
skipping
      [jar] org/apache/avalon/excalibur/logger/factory/JMSTargetFactory.class already added,
skipping
      [jar] org/apache/avalon/excalibur/logger/DefaultLogTargetManager.class already added,
skipping
      [jar] org/apache/avalon/excalibur/logger/factory/FormatterFactory.class already added,
skipping
      [jar] org/apache/avalon/excalibur/logger/LogKitLoggerManager.class already added, skipping
      [jar] org/apache/avalon/excalibur/logger/factory/FileTargetFactory.class already added,
skipping
      [jar] org/apache/avalon/excalibur/logger/LogTargetManager.class already added, skipping
      [jar] org/apache/avalon/excalibur/logger/factory/AbstractTargetFactory.class already
added, skipping
      [jar] META-INF/LICENSE.txt already added, skipping
      [jar] org/apache/avalon/excalibur/logger/factory/SocketTargetFactory.class already added,
skipping
      [jar] org/apache/avalon/excalibur/pool/HardResourceLimitingPool.class already added,
skipping
      [jar] org/apache/avalon/excalibur/pool/AbstractPool.class already added, skipping
      [jar] org/apache/avalon/excalibur/pool/Resizable.class already added, skipping
      [jar] org/apache/avalon/excalibur/pool/Pool.class already added, skipping
      [jar] org/apache/avalon/excalibur/pool/PoolController.class already added, skipping
      [jar] org/apache/avalon/excalibur/pool/Recyclable.class already added, skipping
      [jar] org/apache/avalon/excalibur/pool/ResourceLimitingPool.class already added, skipping
      [jar] org/apache/avalon/excalibur/pool/SingleThreadedPool.class already added, skipping
      [jar] org/apache/avalon/excalibur/pool/Poolable.class already added, skipping
      [jar] org/apache/avalon/excalibur/pool/DefaultPool.class already added, skipping
      [jar] META-INF/LICENSE.txt already added, skipping
      [jar] org/apache/avalon/excalibur/pool/DefaultPoolController.class already added, skipping
      [jar] org/apache/avalon/excalibur/pool/SoftResourceLimitingPool.class already added,
skipping
      [jar] org/apache/avalon/excalibur/pool/Validatable.class already added, skipping
      [jar] org/apache/avalon/excalibur/pool/ValidatedResourceLimitingPool.class already added,
skipping
      [jar] org/apache/avalon/excalibur/pool/DefaultObjectFactory.class already added, skipping
      [jar] org/apache/avalon/excalibur/pool/ObjectFactory.class already added, skipping
      [jar] org/apache/avalon/excalibur/component/Logger2LogKitManager.class already added,
skipping
      [jar] org/apache/avalon/excalibur/component/DefaultComponentSelector.class already added,
skipping
      [jar] org/apache/avalon/excalibur/component/RoleManageable.class already added, skipping
      [jar] org/apache/avalon/excalibur/component/LogkitLoggerManager.class already added,
skipping
      [jar] org/apache/avalon/excalibur/component/ExcaliburComponentManagerCreator.class already
added, skipping
      [jar] org/apache/avalon/excalibur/component/ExcaliburComponentSelector.class already
added, skipping
      [jar] org/apache/avalon/excalibur/component/AbstractDualLogEnabledInstrumentable.class
already added, skipping
      [jar] org/apache/avalon/excalibur/component/DefaultRoleManager.class already added,
skipping
      [jar] org/apache/avalon/excalibur/component/DefaultComponentFactory.class already added,
skipping
      [jar] org/apache/avalon/excalibur/component/ComponentProxyGenerator$ComponentInvocationHandler.class
already added, skipping
      [jar] org/apache/avalon/excalibur/component/DefaultComponentFactory$ComponentManagerProxy.class
already added, skipping
      [jar] org/apache/avalon/excalibur/component/DefaultComponentPool.class already added,
skipping
      [jar] org/apache/avalon/excalibur/component/ThreadSafeComponentHandler.class already
added, skipping
      [jar] org/apache/avalon/excalibur/component/DefaultComponentManager.class already added,
skipping
      [jar] org/apache/avalon/excalibur/component/DefaultComponentPoolController.class already
added, skipping
      [jar] org/apache/avalon/excalibur/component/ExcaliburComponentManager.class already
added, skipping
      [jar] META-INF/LICENSE.txt already added, skipping
      [jar] org/apache/avalon/excalibur/component/DefaultComponentHandler.class already added,
skipping
      [jar] org/apache/avalon/excalibur/component/ComponentHandler.class already added, skipping
      [jar] org/apache/avalon/excalibur/component/DefaultComponentFactory$ServiceManagerProxy.class
already added, skipping
      [jar] org/apache/avalon/excalibur/component/PoolableComponentHandler.class already added,
skipping
      [jar] org/apache/avalon/excalibur/component/AbstractDualLogEnabled.class already added,
skipping
      [jar] org/apache/avalon/excalibur/component/RoleManager.class already added, skipping
      [jar] org/apache/avalon/excalibur/component/ComponentProxyGenerator.class already added,
skipping

dist-jar:
     [copy] Copying 4 files to /home/rubys/jakarta/avalon-excalibur/component/dist

prj-xmlutil:

dependencies:

check-environment:

compile:
    [javac] Compiling 1 source file to /home/rubys/jakarta/avalon-excalibur/xmlutil/build/classes

prepare-conf:

jar:
      [jar] Building jar: /home/rubys/jakarta/avalon-excalibur/xmlutil/build/lib/excalibur-xmlutil-1.0.jar

dist-jar:
     [copy] Copying 1 file to /home/rubys/jakarta/avalon-excalibur/xmlutil/dist

prj-instrument-client:

dependencies:

compile:

prepare-conf:

altrmiproxies:

altrmiproxies:
   [delete] Deleting 4 files from /home/rubys/jakarta/avalon-excalibur/instrument-client/build/genjava
   [delete] Deleting 4 files from /home/rubys/jakarta/avalon-excalibur/instrument-client/build/classes
[altrmiproxies] Note: sun.tools.javac.Main has been deprecated.
[altrmiproxies] 1 warning


jar:
      [jar] Building jar: /home/rubys/jakarta/avalon-excalibur/instrument-client/build/lib/excalibur-instrument-client-0.3.jar

dist-jar:
    [mkdir] Created dir: /home/rubys/jakarta/avalon-excalibur/instrument-client/dist
    [mkdir] Created dir: /home/rubys/jakarta/avalon-excalibur/instrument-client/dist/bin
    [mkdir] Created dir: /home/rubys/jakarta/avalon-excalibur/instrument-client/dist/conf
    [mkdir] Created dir: /home/rubys/jakarta/avalon-excalibur/instrument-client/dist/lib
     [copy] Copying 3 files to /home/rubys/jakarta/avalon-excalibur/instrument-client/dist/bin
     [copy] Copying 1 file to /home/rubys/jakarta/avalon-excalibur/instrument-client/dist/conf
     [copy] Copying 2 files to /home/rubys/jakarta/avalon-excalibur/instrument-client/dist/lib
     [copy] Copying 1 file to /home/rubys/jakarta/avalon-excalibur/instrument-client/dist/lib
     [copy] Copying 1 file to /home/rubys/jakarta/avalon-excalibur/instrument-client/dist/lib
     [copy] Copying 1 file to /home/rubys/jakarta/avalon-excalibur/instrument-client/dist/lib
     [copy] Copying 1 file to /home/rubys/jakarta/avalon-excalibur/instrument-client/dist/lib
     [copy] Copying 1 file to /home/rubys/jakarta/avalon-excalibur/instrument-client/dist/lib
     [copy] Copying 1 file to /home/rubys/jakarta/avalon-excalibur/instrument-client/dist/lib
     [copy] Copying 1 file to /home/rubys/jakarta/avalon-excalibur/instrument-client/dist/lib
     [copy] Copying 1 file to /home/rubys/jakarta/avalon-excalibur/instrument-client/dist/lib

build-all-subprojects:
    [jlink] linking:     /home/rubys/jakarta/avalon-excalibur/avalon-excalibur-tmpA.jar
    [jlink] linking:     /home/rubys/jakarta/avalon-excalibur/avalon-excalibur-tmpB.jar
    [jlink] linking:     /home/rubys/jakarta/avalon-excalibur/avalon-excalibur-tmpAB.jar
      [jar] Building jar: /home/rubys/jakarta/avalon-excalibur/avalon-excalibur.jar
   [delete] Deleting: /home/rubys/jakarta/avalon-excalibur/avalon-excalibur-tmpA.jar
   [delete] Deleting: /home/rubys/jakarta/avalon-excalibur/avalon-excalibur-tmpB.jar
   [delete] Deleting: /home/rubys/jakarta/avalon-excalibur/avalon-excalibur-tmpAB.jar

build-subprojects-dist:

prj-compatibility:

dependencies:

compile:

prepare-conf:

jar:

dist-jar:

dependencies-test:

compile-test:

test:
     [echo] Performing Unit Tests
    [junit] Running org.apache.avalon.excalibur.io.test.DemuxTestCase
    [junit] Tests run: 1, Failures: 0, Errors: 1, Time elapsed: 0 sec
    [junit] Testsuite: org.apache.avalon.excalibur.io.test.DemuxTestCase
    [junit] Tests run: 1, Failures: 0, Errors: 1, Time elapsed: 0 sec

    [junit] 	Caused an ERROR
    [junit] org.apache.avalon.excalibur.io.test.DemuxTestCase
    [junit] java.lang.ClassNotFoundException: org.apache.avalon.excalibur.io.test.DemuxTestCase
    [junit] 	at java.net.URLClassLoader$1.run(URLClassLoader.java:198)
    [junit] 	at java.security.AccessController.doPrivileged(Native Method)
    [junit] 	at java.net.URLClassLoader.findClass(URLClassLoader.java:186)
    [junit] 	at java.lang.ClassLoader.loadClass(ClassLoader.java:299)
    [junit] 	at sun.misc.Launcher$AppClassLoader.loadClass(Launcher.java:265)
    [junit] 	at java.lang.ClassLoader.loadClass(ClassLoader.java:255)
    [junit] 	at java.lang.ClassLoader.loadClassInternal(ClassLoader.java:315)
    [junit] 	at java.lang.Class.forName0(Native Method)
    [junit] 	at java.lang.Class.forName(Class.java:140)

    [junit] TEST org.apache.avalon.excalibur.io.test.DemuxTestCase FAILED
    [junit] Running org.apache.avalon.excalibur.io.test.FileUtilTestCase
    [junit] Tests run: 1, Failures: 0, Errors: 1, Time elapsed: 0 sec
    [junit] Testsuite: org.apache.avalon.excalibur.io.test.FileUtilTestCase
    [junit] Tests run: 1, Failures: 0, Errors: 1, Time elapsed: 0 sec

    [junit] 	Caused an ERROR
    [junit] org.apache.avalon.excalibur.io.test.FileUtilTestCase
    [junit] java.lang.ClassNotFoundException: org.apache.avalon.excalibur.io.test.FileUtilTestCase
    [junit] 	at java.net.URLClassLoader$1.run(URLClassLoader.java:198)
    [junit] 	at java.security.AccessController.doPrivileged(Native Method)
    [junit] 	at java.net.URLClassLoader.findClass(URLClassLoader.java:186)
    [junit] 	at java.lang.ClassLoader.loadClass(ClassLoader.java:299)
    [junit] 	at sun.misc.Launcher$AppClassLoader.loadClass(Launcher.java:265)
    [junit] 	at java.lang.ClassLoader.loadClass(ClassLoader.java:255)
    [junit] 	at java.lang.ClassLoader.loadClassInternal(ClassLoader.java:315)
    [junit] 	at java.lang.Class.forName0(Native Method)
    [junit] 	at java.lang.Class.forName(Class.java:140)

    [junit] TEST org.apache.avalon.excalibur.io.test.FileUtilTestCase FAILED
    [junit] Running org.apache.avalon.excalibur.io.test.IOUtilTestCase
    [junit] Tests run: 1, Failures: 0, Errors: 1, Time elapsed: 0 sec
    [junit] Testsuite: org.apache.avalon.excalibur.io.test.IOUtilTestCase
    [junit] Tests run: 1, Failures: 0, Errors: 1, Time elapsed: 0 sec

    [junit] 	Caused an ERROR
    [junit] org.apache.avalon.excalibur.io.test.IOUtilTestCase
    [junit] java.lang.ClassNotFoundException: org.apache.avalon.excalibur.io.test.IOUtilTestCase
    [junit] 	at java.net.URLClassLoader$1.run(URLClassLoader.java:198)
    [junit] 	at java.security.AccessController.doPrivileged(Native Method)
    [junit] 	at java.net.URLClassLoader.findClass(URLClassLoader.java:186)
    [junit] 	at java.lang.ClassLoader.loadClass(ClassLoader.java:299)
    [junit] 	at sun.misc.Launcher$AppClassLoader.loadClass(Launcher.java:265)
    [junit] 	at java.lang.ClassLoader.loadClass(ClassLoader.java:255)
    [junit] 	at java.lang.ClassLoader.loadClassInternal(ClassLoader.java:315)
    [junit] 	at java.lang.Class.forName0(Native Method)
    [junit] 	at java.lang.Class.forName(Class.java:140)

    [junit] TEST org.apache.avalon.excalibur.io.test.IOUtilTestCase FAILED
    [junit] Running org.apache.avalon.excalibur.naming.rmi.test.RMIContextTestCase
    [junit] Tests run: 1, Failures: 0, Errors: 1, Time elapsed: 0 sec
    [junit] Testsuite: org.apache.avalon.excalibur.naming.rmi.test.RMIContextTestCase
    [junit] Tests run: 1, Failures: 0, Errors: 1, Time elapsed: 0 sec

    [junit] 	Caused an ERROR
    [junit] org.apache.avalon.excalibur.naming.rmi.test.RMIContextTestCase
    [junit] java.lang.ClassNotFoundException: org.apache.avalon.excalibur.naming.rmi.test.RMIContextTestCase
    [junit] 	at java.net.URLClassLoader$1.run(URLClassLoader.java:198)
    [junit] 	at java.security.AccessController.doPrivileged(Native Method)
    [junit] 	at java.net.URLClassLoader.findClass(URLClassLoader.java:186)
    [junit] 	at java.lang.ClassLoader.loadClass(ClassLoader.java:299)
    [junit] 	at sun.misc.Launcher$AppClassLoader.loadClass(Launcher.java:265)
    [junit] 	at java.lang.ClassLoader.loadClass(ClassLoader.java:255)
    [junit] 	at java.lang.ClassLoader.loadClassInternal(ClassLoader.java:315)
    [junit] 	at java.lang.Class.forName0(Native Method)
    [junit] 	at java.lang.Class.forName(Class.java:140)

    [junit] TEST org.apache.avalon.excalibur.naming.rmi.test.RMIContextTestCase FAILED
    [junit] Running org.apache.avalon.excalibur.naming.memory.test.MemoryContextTestCase
    [junit] Tests run: 1, Failures: 0, Errors: 1, Time elapsed: 0 sec
    [junit] Testsuite: org.apache.avalon.excalibur.naming.memory.test.MemoryContextTestCase
    [junit] Tests run: 1, Failures: 0, Errors: 1, Time elapsed: 0 sec

    [junit] 	Caused an ERROR
    [junit] org.apache.avalon.excalibur.naming.memory.test.MemoryContextTestCase
    [junit] java.lang.ClassNotFoundException: org.apache.avalon.excalibur.naming.memory.test.MemoryContextTestCase
    [junit] 	at java.net.URLClassLoader$1.run(URLClassLoader.java:198)
    [junit] 	at java.security.AccessController.doPrivileged(Native Method)
    [junit] 	at java.net.URLClassLoader.findClass(URLClassLoader.java:186)
    [junit] 	at java.lang.ClassLoader.loadClass(ClassLoader.java:299)
    [junit] 	at sun.misc.Launcher$AppClassLoader.loadClass(Launcher.java:265)
    [junit] 	at java.lang.ClassLoader.loadClass(ClassLoader.java:255)
    [junit] 	at java.lang.ClassLoader.loadClassInternal(ClassLoader.java:315)
    [junit] 	at java.lang.Class.forName0(Native Method)
    [junit] 	at java.lang.Class.forName(Class.java:140)

    [junit] TEST org.apache.avalon.excalibur.naming.memory.test.MemoryContextTestCase FAILED
    [junit] Running org.apache.avalon.excalibur.concurrent.test.ReadWriteLockTestCase
    [junit] Tests run: 1, Failures: 0, Errors: 1, Time elapsed: 0 sec
    [junit] Testsuite: org.apache.avalon.excalibur.concurrent.test.ReadWriteLockTestCase
    [junit] Tests run: 1, Failures: 0, Errors: 1, Time elapsed: 0 sec

    [junit] 	Caused an ERROR
    [junit] org.apache.avalon.excalibur.concurrent.test.ReadWriteLockTestCase
    [junit] java.lang.ClassNotFoundException: org.apache.avalon.excalibur.concurrent.test.ReadWriteLockTestCase
    [junit] 	at java.net.URLClassLoader$1.run(URLClassLoader.java:198)
    [junit] 	at java.security.AccessController.doPrivileged(Native Method)
    [junit] 	at java.net.URLClassLoader.findClass(URLClassLoader.java:186)
    [junit] 	at java.lang.ClassLoader.loadClass(ClassLoader.java:299)
    [junit] 	at sun.misc.Launcher$AppClassLoader.loadClass(Launcher.java:265)
    [junit] 	at java.lang.ClassLoader.loadClass(ClassLoader.java:255)
    [junit] 	at java.lang.ClassLoader.loadClassInternal(ClassLoader.java:315)
    [junit] 	at java.lang.Class.forName0(Native Method)
    [junit] 	at java.lang.Class.forName(Class.java:140)

    [junit] TEST org.apache.avalon.excalibur.concurrent.test.ReadWriteLockTestCase FAILED
    [junit] Running org.apache.avalon.excalibur.cli.test.ClutilTestCase
    [junit] Tests run: 1, Failures: 0, Errors: 1, Time elapsed: 0 sec
    [junit] Testsuite: org.apache.avalon.excalibur.cli.test.ClutilTestCase
    [junit] Tests run: 1, Failures: 0, Errors: 1, Time elapsed: 0 sec

    [junit] 	Caused an ERROR
    [junit] org.apache.avalon.excalibur.cli.test.ClutilTestCase
    [junit] java.lang.ClassNotFoundException: org.apache.avalon.excalibur.cli.test.ClutilTestCase
    [junit] 	at java.net.URLClassLoader$1.run(URLClassLoader.java:198)
    [junit] 	at java.security.AccessController.doPrivileged(Native Method)
    [junit] 	at java.net.URLClassLoader.findClass(URLClassLoader.java:186)
    [junit] 	at java.lang.ClassLoader.loadClass(ClassLoader.java:299)
    [junit] 	at sun.misc.Launcher$AppClassLoader.loadClass(Launcher.java:265)
    [junit] 	at java.lang.ClassLoader.loadClass(ClassLoader.java:255)
    [junit] 	at java.lang.ClassLoader.loadClassInternal(ClassLoader.java:315)
    [junit] 	at java.lang.Class.forName0(Native Method)
    [junit] 	at java.lang.Class.forName(Class.java:140)

    [junit] TEST org.apache.avalon.excalibur.cli.test.ClutilTestCase FAILED
    [junit] Running org.apache.avalon.excalibur.collections.test.VariableSizeBufferTestCase
    [junit] Tests run: 1, Failures: 0, Errors: 1, Time elapsed: 0 sec
    [junit] Testsuite: org.apache.avalon.excalibur.collections.test.VariableSizeBufferTestCase
    [junit] Tests run: 1, Failures: 0, Errors: 1, Time elapsed: 0 sec

    [junit] 	Caused an ERROR
    [junit] org.apache.avalon.excalibur.collections.test.VariableSizeBufferTestCase
    [junit] java.lang.ClassNotFoundException: org.apache.avalon.excalibur.collections.test.VariableSizeBufferTestCase
    [junit] 	at java.net.URLClassLoader$1.run(URLClassLoader.java:198)
    [junit] 	at java.security.AccessController.doPrivileged(Native Method)
    [junit] 	at java.net.URLClassLoader.findClass(URLClassLoader.java:186)
    [junit] 	at java.lang.ClassLoader.loadClass(ClassLoader.java:299)
    [junit] 	at sun.misc.Launcher$AppClassLoader.loadClass(Launcher.java:265)
    [junit] 	at java.lang.ClassLoader.loadClass(ClassLoader.java:255)
    [junit] 	at java.lang.ClassLoader.loadClassInternal(ClassLoader.java:315)
    [junit] 	at java.lang.Class.forName0(Native Method)
    [junit] 	at java.lang.Class.forName(Class.java:140)

    [junit] TEST org.apache.avalon.excalibur.collections.test.VariableSizeBufferTestCase FAILED
    [junit] Running org.apache.avalon.excalibur.collections.test.ThreadedMapTest
    [junit] Tests run: 1, Failures: 0, Errors: 1, Time elapsed: 0 sec
    [junit] Testsuite: org.apache.avalon.excalibur.collections.test.ThreadedMapTest
    [junit] Tests run: 1, Failures: 0, Errors: 1, Time elapsed: 0 sec

    [junit] 	Caused an ERROR
    [junit] org.apache.avalon.excalibur.collections.test.ThreadedMapTest
    [junit] java.lang.ClassNotFoundException: org.apache.avalon.excalibur.collections.test.ThreadedMapTest
    [junit] 	at java.net.URLClassLoader$1.run(URLClassLoader.java:198)
    [junit] 	at java.security.AccessController.doPrivileged(Native Method)
    [junit] 	at java.net.URLClassLoader.findClass(URLClassLoader.java:186)
    [junit] 	at java.lang.ClassLoader.loadClass(ClassLoader.java:299)
    [junit] 	at sun.misc.Launcher$AppClassLoader.loadClass(Launcher.java:265)
    [junit] 	at java.lang.ClassLoader.loadClass(ClassLoader.java:255)
    [junit] 	at java.lang.ClassLoader.loadClassInternal(ClassLoader.java:315)
    [junit] 	at java.lang.Class.forName0(Native Method)
    [junit] 	at java.lang.Class.forName(Class.java:140)

    [junit] TEST org.apache.avalon.excalibur.collections.test.ThreadedMapTest FAILED
    [junit] Running org.apache.avalon.excalibur.collections.test.BinaryHeapTestCase
    [junit] Tests run: 1, Failures: 0, Errors: 1, Time elapsed: 0 sec
    [junit] Testsuite: org.apache.avalon.excalibur.collections.test.BinaryHeapTestCase
    [junit] Tests run: 1, Failures: 0, Errors: 1, Time elapsed: 0 sec

    [junit] 	Caused an ERROR
    [junit] org.apache.avalon.excalibur.collections.test.BinaryHeapTestCase
    [junit] java.lang.ClassNotFoundException: org.apache.avalon.excalibur.collections.test.BinaryHeapTestCase
    [junit] 	at java.net.URLClassLoader$1.run(URLClassLoader.java:198)
    [junit] 	at java.security.AccessController.doPrivileged(Native Method)
    [junit] 	at java.net.URLClassLoader.findClass(URLClassLoader.java:186)
    [junit] 	at java.lang.ClassLoader.loadClass(ClassLoader.java:299)
    [junit] 	at sun.misc.Launcher$AppClassLoader.loadClass(Launcher.java:265)
    [junit] 	at java.lang.ClassLoader.loadClass(ClassLoader.java:255)
    [junit] 	at java.lang.ClassLoader.loadClassInternal(ClassLoader.java:315)
    [junit] 	at java.lang.Class.forName0(Native Method)
    [junit] 	at java.lang.Class.forName(Class.java:140)

    [junit] TEST org.apache.avalon.excalibur.collections.test.BinaryHeapTestCase FAILED
    [junit] Running org.apache.avalon.excalibur.collections.test.BucketMapTestCase
    [junit] Tests run: 1, Failures: 0, Errors: 1, Time elapsed: 0 sec
    [junit] Testsuite: org.apache.avalon.excalibur.collections.test.BucketMapTestCase
    [junit] Tests run: 1, Failures: 0, Errors: 1, Time elapsed: 0 sec

    [junit] 	Caused an ERROR
    [junit] org.apache.avalon.excalibur.collections.test.BucketMapTestCase
    [junit] java.lang.ClassNotFoundException: org.apache.avalon.excalibur.collections.test.BucketMapTestCase
    [junit] 	at java.net.URLClassLoader$1.run(URLClassLoader.java:198)
    [junit] 	at java.security.AccessController.doPrivileged(Native Method)
    [junit] 	at java.net.URLClassLoader.findClass(URLClassLoader.java:186)
    [junit] 	at java.lang.ClassLoader.loadClass(ClassLoader.java:299)
    [junit] 	at sun.misc.Launcher$AppClassLoader.loadClass(Launcher.java:265)
    [junit] 	at java.lang.ClassLoader.loadClass(ClassLoader.java:255)
    [junit] 	at java.lang.ClassLoader.loadClassInternal(ClassLoader.java:315)
    [junit] 	at java.lang.Class.forName0(Native Method)
    [junit] 	at java.lang.Class.forName(Class.java:140)

    [junit] TEST org.apache.avalon.excalibur.collections.test.BucketMapTestCase FAILED

test-reports:

checkBSF:

checkRequiredClass:

checkRequiredClass.fail:
    [mkdir] Created dir: /home/rubys/jakarta/avalon-excalibur/compatibility/build/reports/junit
[junitreport] Using Xalan version: Xalan Java 2.5.0
[junitreport] Transform time: 4053ms

checkstyle:

checkstyle-report:

setup-filters:

docs:
    [mkdir] Created dir: /home/rubys/jakarta/avalon-excalibur/compatibility/dist/docs

forrest.loadenv:

forrest.checkenv:

forrest.checkhome:

forrest.check-build.properties:

forrest.check-project.properties:

forrest.check-ant.properties:

forrest.check-.ant.properties:

forrest.sethome:

forrest.home.defined:
     [echo] 
     [echo]       ----------------------------------------------
     [echo]       To run this target, you need Forrest installed.
     [echo]       Please do the following:
     [echo] 
     [echo]       export CVSROOT=:pserver:anoncvs@cvs.apache.org:/home/cvspublic
     [echo]       cvs checkout xml-forrest
     [echo]       cd xml-forrest
     [echo]       build      (Windows)
     [echo]       ./build.sh (Unix)
     [echo] 
     [echo]       Then either:
     [echo] 
     [echo]       - Set FORREST_HOME as the Forrest build instructions describe
     [echo]       - Create a build.properties, with the forrest.home property pointing to
     [echo]         the forrest shbat directory, eg:
     [echo] 
     [echo]         forrest.home=\home\rubys\xml-forrest\build\dist\shbat  (Windows)
     [echo]         forrest.home=/home/rubys/xml-forrest/build/dist/shbat  (Unix)
     [echo] 
     [echo]         (adjusting the path according to where your xml-forrest is)
     [echo]       ----------------------------------------------
     [echo]     

BUILD FAILED
/home/rubys/jakarta/avalon-excalibur/forrestbuild.xml:154: Need to define ${forrest.home}

Total time: 53 seconds

---------------------------------------------------------------------
To unsubscribe, e-mail: dev-unsubscribe@avalon.apache.org
For additional commands, e-mail: dev-help@avalon.apache.org


Mime
View raw message