avalon-dev mailing list archives

Site index · List index
Message view « Date » · « Thread »
Top « Date » · « Thread »
From Peter Donald <pe...@apache.org>
Subject [GUMP] Build Failure - jakarta-avalon-excalibur
Date Tue, 24 Dec 2002 13:49:24 GMT
----------------------------------------------------
This email is autogenerated from the output from:
<http://cvs.apache.org/builds/gump/2002-12-24/jakarta-avalon-excalibur.html>
----------------------------------------------------

Buildfile: build.xml

jar:

prj-zip:

dependencies:

compile:

prepare-conf:

jar:
      [jar] Building jar: /home/rubys/jakarta/jakarta-avalon-excalibur/zip/build/lib/excalibur-zip-1.0.jar

dist-jar:
    [mkdir] Created dir: /home/rubys/jakarta/jakarta-avalon-excalibur/zip/dist
     [copy] Copying 2 files to /home/rubys/jakarta/jakarta-avalon-excalibur/zip/dist

prj-cli:

dependencies:

compile:

prepare-conf:

jar:
      [jar] Building jar: /home/rubys/jakarta/jakarta-avalon-excalibur/cli/build/lib/excalibur-cli-1.0.jar

dist-jar:
    [mkdir] Created dir: /home/rubys/jakarta/jakarta-avalon-excalibur/cli/dist
     [copy] Copying 2 files to /home/rubys/jakarta/jakarta-avalon-excalibur/cli/dist

prj-bzip2:

dependencies:

compile:
    [mkdir] Created dir: /home/rubys/jakarta/jakarta-avalon-excalibur/bzip2/build/classes
    [javac] Compiling 4 source files to /home/rubys/jakarta/jakarta-avalon-excalibur/bzip2/build/classes

prepare-conf:
    [mkdir] Created dir: /home/rubys/jakarta/jakarta-avalon-excalibur/bzip2/build/conf
     [copy] Copying 1 file to /home/rubys/jakarta/jakarta-avalon-excalibur/bzip2/build/conf

jar:
    [mkdir] Created dir: /home/rubys/jakarta/jakarta-avalon-excalibur/bzip2/build/lib
      [jar] Building jar: /home/rubys/jakarta/jakarta-avalon-excalibur/bzip2/build/lib/excalibur-bzip2-1.0.jar

dist-jar:
    [mkdir] Created dir: /home/rubys/jakarta/jakarta-avalon-excalibur/bzip2/dist
     [copy] Copying 1 file to /home/rubys/jakarta/jakarta-avalon-excalibur/bzip2/dist

prj-baxter:

check-environment:

dependencies.jmx:

dependencies.optional:

dependencies:

jmx-warning:
     [echo] **********************************************
     [echo] *                 JMX MISSING                 
     [echo] *                                             
     [echo] * The JMX.jar file could not be located so    
     [echo] * the Baxter classes could not be compiled.   
     [echo] **********************************************

compile:
    [mkdir] Created dir: /home/rubys/jakarta/jakarta-avalon-excalibur/baxter/build/classes
     [copy] Copied 2 empty directories to /home/rubys/jakarta/jakarta-avalon-excalibur/baxter/build/classes

prepare-conf:
    [mkdir] Created dir: /home/rubys/jakarta/jakarta-avalon-excalibur/baxter/build/conf
     [copy] Copying 1 file to /home/rubys/jakarta/jakarta-avalon-excalibur/baxter/build/conf

jar:
    [mkdir] Created dir: /home/rubys/jakarta/jakarta-avalon-excalibur/baxter/build/lib
      [jar] Building jar: /home/rubys/jakarta/jakarta-avalon-excalibur/baxter/build/lib/excalibur-baxter-1.0a.jar

dist-jar:
    [mkdir] Created dir: /home/rubys/jakarta/jakarta-avalon-excalibur/baxter/dist
     [copy] Copying 1 file to /home/rubys/jakarta/jakarta-avalon-excalibur/baxter/dist

prj-io:

dependencies:

compile:

prepare-conf:

jar:
      [jar] Building jar: /home/rubys/jakarta/jakarta-avalon-excalibur/io/build/lib/excalibur-io-1.1.jar

dist-jar:
    [mkdir] Created dir: /home/rubys/jakarta/jakarta-avalon-excalibur/io/dist
     [copy] Copying 2 files to /home/rubys/jakarta/jakarta-avalon-excalibur/io/dist

prj-loader:

dependencies:

compile:
    [mkdir] Created dir: /home/rubys/jakarta/jakarta-avalon-excalibur/loader/build/classes
    [javac] Compiling 12 source files to /home/rubys/jakarta/jakarta-avalon-excalibur/loader/build/classes
     [copy] Copying 3 files to /home/rubys/jakarta/jakarta-avalon-excalibur/loader/build/classes

prepare-conf:
    [mkdir] Created dir: /home/rubys/jakarta/jakarta-avalon-excalibur/loader/build/conf
     [copy] Copying 1 file to /home/rubys/jakarta/jakarta-avalon-excalibur/loader/build/conf

jar:
    [mkdir] Created dir: /home/rubys/jakarta/jakarta-avalon-excalibur/loader/build/lib
      [jar] Building jar: /home/rubys/jakarta/jakarta-avalon-excalibur/loader/build/lib/excalibur-loader-1.0a.jar

dist-jar:
    [mkdir] Created dir: /home/rubys/jakarta/jakarta-avalon-excalibur/loader/dist
     [copy] Copying 1 file to /home/rubys/jakarta/jakarta-avalon-excalibur/loader/dist

prj-naming:

dependencies:

compile:
    [mkdir] Created dir: /home/rubys/jakarta/jakarta-avalon-excalibur/naming/build/classes
    [javac] Compiling 19 source files to /home/rubys/jakarta/jakarta-avalon-excalibur/naming/build/classes
     [rmic] RMI Compiling 1 class to /home/rubys/jakarta/jakarta-avalon-excalibur/naming/build/classes

prepare-conf:
    [mkdir] Created dir: /home/rubys/jakarta/jakarta-avalon-excalibur/naming/build/conf
     [copy] Copying 1 file to /home/rubys/jakarta/jakarta-avalon-excalibur/naming/build/conf

jar:
    [mkdir] Created dir: /home/rubys/jakarta/jakarta-avalon-excalibur/naming/build/lib
      [jar] Building jar: /home/rubys/jakarta/jakarta-avalon-excalibur/naming/build/lib/excalibur-naming-1.0.jar

dist-jar:
    [mkdir] Created dir: /home/rubys/jakarta/jakarta-avalon-excalibur/naming/dist
     [copy] Copying 1 file to /home/rubys/jakarta/jakarta-avalon-excalibur/naming/dist

prj-threadcontext:

dependencies:

compile:

prepare-conf:

jar:
      [jar] Building jar: /home/rubys/jakarta/jakarta-avalon-excalibur/threadcontext/build/lib/excalibur-threadcontext-1.0.jar

dist-jar:
    [mkdir] Created dir: /home/rubys/jakarta/jakarta-avalon-excalibur/threadcontext/dist
     [copy] Copying 2 files to /home/rubys/jakarta/jakarta-avalon-excalibur/threadcontext/dist

prj-jprocess:

dependencies:

compile:
    [mkdir] Created dir: /home/rubys/jakarta/jakarta-avalon-excalibur/jprocess/build/classes
    [javac] Compiling 7 source files to /home/rubys/jakarta/jakarta-avalon-excalibur/jprocess/build/classes

prepare-conf:
    [mkdir] Created dir: /home/rubys/jakarta/jakarta-avalon-excalibur/jprocess/build/conf
     [copy] Copying 1 file to /home/rubys/jakarta/jakarta-avalon-excalibur/jprocess/build/conf

jar:
    [mkdir] Created dir: /home/rubys/jakarta/jakarta-avalon-excalibur/jprocess/build/lib
      [jar] Building jar: /home/rubys/jakarta/jakarta-avalon-excalibur/jprocess/build/lib/excalibur-jprocess-0.99.jar

dist-jar:
    [mkdir] Created dir: /home/rubys/jakarta/jakarta-avalon-excalibur/jprocess/dist
     [copy] Copying 1 file to /home/rubys/jakarta/jakarta-avalon-excalibur/jprocess/dist

prj-tar:

dependencies:

compile:
    [mkdir] Created dir: /home/rubys/jakarta/jakarta-avalon-excalibur/tar/build/classes
    [javac] Compiling 6 source files to /home/rubys/jakarta/jakarta-avalon-excalibur/tar/build/classes

prepare-conf:
    [mkdir] Created dir: /home/rubys/jakarta/jakarta-avalon-excalibur/tar/build/conf
     [copy] Copying 1 file to /home/rubys/jakarta/jakarta-avalon-excalibur/tar/build/conf

jar:
    [mkdir] Created dir: /home/rubys/jakarta/jakarta-avalon-excalibur/tar/build/lib
      [jar] Building jar: /home/rubys/jakarta/jakarta-avalon-excalibur/tar/build/lib/excalibur-tar-1.0a.jar

dist-jar:
    [mkdir] Created dir: /home/rubys/jakarta/jakarta-avalon-excalibur/tar/dist
     [copy] Copying 1 file to /home/rubys/jakarta/jakarta-avalon-excalibur/tar/dist

prj-collections:

dependencies:

compile:

prepare-conf:

jar:
      [jar] Building jar: /home/rubys/jakarta/jakarta-avalon-excalibur/collections/build/lib/excalibur-collections-1.0.jar

dist-jar:
    [mkdir] Created dir: /home/rubys/jakarta/jakarta-avalon-excalibur/collections/dist
     [copy] Copying 2 files to /home/rubys/jakarta/jakarta-avalon-excalibur/collections/dist

prj-i18n:

dependencies:

compile:

prepare-conf:

jar:
      [jar] Building jar: /home/rubys/jakarta/jakarta-avalon-excalibur/i18n/build/lib/excalibur-i18n-1.0.jar

dist-jar:
    [mkdir] Created dir: /home/rubys/jakarta/jakarta-avalon-excalibur/i18n/dist
     [copy] Copying 2 files to /home/rubys/jakarta/jakarta-avalon-excalibur/i18n/dist

prj-converter:

dependencies:

compile:

prepare-conf:

jar:
      [jar] Building jar: /home/rubys/jakarta/jakarta-avalon-excalibur/converter/build/lib/excalibur-converter-1.0.jar

dist-jar:
    [mkdir] Created dir: /home/rubys/jakarta/jakarta-avalon-excalibur/converter/dist
     [copy] Copying 2 files to /home/rubys/jakarta/jakarta-avalon-excalibur/converter/dist

prj-extension:

dependencies:

compile:

prepare-conf:

jar:
      [jar] Building jar: /home/rubys/jakarta/jakarta-avalon-excalibur/extension/build/lib/excalibur-extension-1.0a.jar

dist-jar:
    [mkdir] Created dir: /home/rubys/jakarta/jakarta-avalon-excalibur/extension/dist
     [copy] Copying 2 files to /home/rubys/jakarta/jakarta-avalon-excalibur/extension/dist

prj-concurrent:

dependencies:

compile:

prepare-conf:

jar:
      [jar] Building jar: /home/rubys/jakarta/jakarta-avalon-excalibur/concurrent/build/lib/excalibur-concurrent-1.0.jar

dist-jar:
    [mkdir] Created dir: /home/rubys/jakarta/jakarta-avalon-excalibur/concurrent/dist
     [copy] Copying 2 files to /home/rubys/jakarta/jakarta-avalon-excalibur/concurrent/dist

prj-instrument:

dependencies:

check-environment:

framework-warning:

compile:

prepare-conf:

jar:
      [jar] Building jar: /home/rubys/jakarta/jakarta-avalon-excalibur/instrument/build/lib/excalibur-instrument-0.3.jar

dist-jar:
    [mkdir] Created dir: /home/rubys/jakarta/jakarta-avalon-excalibur/instrument/dist
     [copy] Copying 2 files to /home/rubys/jakarta/jakarta-avalon-excalibur/instrument/dist

prj-pool:

dependencies:

compile:

prepare-conf:

jar:
      [jar] Building jar: /home/rubys/jakarta/jakarta-avalon-excalibur/pool/build/lib/excalibur-pool-1.1.jar

dist-jar:
    [mkdir] Created dir: /home/rubys/jakarta/jakarta-avalon-excalibur/pool/dist
     [copy] Copying 2 files to /home/rubys/jakarta/jakarta-avalon-excalibur/pool/dist

prj-altrmi:

dependencies:

checkJettyJars:

warnJettyJars:

compile:

jar:
      [jar] Building jar: /home/rubys/jakarta/jakarta-avalon-excalibur/altrmi/build/lib/excalibur-altrmi-common-0.7.jar
      [jar] Building jar: /home/rubys/jakarta/jakarta-avalon-excalibur/altrmi/build/lib/excalibur-altrmi-client-interfaces-0.7.jar
      [jar] Building jar: /home/rubys/jakarta/jakarta-avalon-excalibur/altrmi/build/lib/excalibur-altrmi-client-impl-0.7.jar
      [jar] Building jar: /home/rubys/jakarta/jakarta-avalon-excalibur/altrmi/build/lib/excalibur-altrmi-server-interfaces-0.7.jar
      [jar] Building jar: /home/rubys/jakarta/jakarta-avalon-excalibur/altrmi/build/lib/excalibur-altrmi-server-impl-0.7.jar
      [jar] Building jar: /home/rubys/jakarta/jakarta-avalon-excalibur/altrmi/build/lib/excalibur-altrmi-generator-0.7.jar
      [jar] Building jar: /home/rubys/jakarta/jakarta-avalon-excalibur/altrmi/build/lib/excalibur-altrmi-registry-0.7.jar

dist-jar:
     [copy] Copying 7 files to /home/rubys/jakarta/jakarta-avalon-excalibur/altrmi/dist

prj-container:

dependencies:

compile:

prepare-conf:

jar:
      [jar] Building jar: /home/rubys/jakarta/jakarta-avalon-excalibur/container/build/lib/excalibur-container-1.0.jar

dist-jar:
    [mkdir] Created dir: /home/rubys/jakarta/jakarta-avalon-excalibur/container/dist
     [copy] Copying 2 files to /home/rubys/jakarta/jakarta-avalon-excalibur/container/dist

prj-cache:

dependencies:

compile:
    [mkdir] Created dir: /home/rubys/jakarta/jakarta-avalon-excalibur/cache/build/classes
    [javac] Compiling 21 source files to /home/rubys/jakarta/jakarta-avalon-excalibur/cache/build/classes
    [javac] Note: /home/rubys/jakarta/jakarta-avalon-excalibur/cache/src/java/org/apache/excalibur/cache/Cache.java
uses or overrides a deprecated API.
    [javac] Note: Recompile with -deprecation for details.
     [copy] Copying 2 files to /home/rubys/jakarta/jakarta-avalon-excalibur/cache/build/classes

prepare-conf:
    [mkdir] Created dir: /home/rubys/jakarta/jakarta-avalon-excalibur/cache/build/conf
     [copy] Copying 1 file to /home/rubys/jakarta/jakarta-avalon-excalibur/cache/build/conf

jar:
    [mkdir] Created dir: /home/rubys/jakarta/jakarta-avalon-excalibur/cache/build/lib
      [jar] Building jar: /home/rubys/jakarta/jakarta-avalon-excalibur/cache/build/lib/excalibur-cache-1.0a.jar

dist-jar:
    [mkdir] Created dir: /home/rubys/jakarta/jakarta-avalon-excalibur/cache/dist
     [copy] Copying 1 file to /home/rubys/jakarta/jakarta-avalon-excalibur/cache/dist

prj-configuration:

dependencies:

compile:

prepare-conf:

jar:
      [jar] Building jar: /home/rubys/jakarta/jakarta-avalon-excalibur/configuration/build/lib/excalibur-configuration-1.0.jar

dist-jar:
    [mkdir] Created dir: /home/rubys/jakarta/jakarta-avalon-excalibur/configuration/dist
     [copy] Copying 2 files to /home/rubys/jakarta/jakarta-avalon-excalibur/configuration/dist

prj-thread:

dependencies:

compile:

prepare-conf:

jar:
      [jar] Building jar: /home/rubys/jakarta/jakarta-avalon-excalibur/thread/build/lib/excalibur-thread-1.0.jar

dist-jar:
    [mkdir] Created dir: /home/rubys/jakarta/jakarta-avalon-excalibur/thread/dist
     [copy] Copying 2 files to /home/rubys/jakarta/jakarta-avalon-excalibur/thread/dist

prj-event:

dependencies:

compile:

prepare-conf:

jar:
      [jar] Building jar: /home/rubys/jakarta/jakarta-avalon-excalibur/event/build/lib/excalibur-event-1.0.1.jar

dist-jar:
    [mkdir] Created dir: /home/rubys/jakarta/jakarta-avalon-excalibur/event/dist
     [copy] Copying 2 files to /home/rubys/jakarta/jakarta-avalon-excalibur/event/dist
    [mkdir] Created dir: /home/rubys/jakarta/jakarta-avalon-excalibur/event/dist/lib
     [copy] Copying 2 files to /home/rubys/jakarta/jakarta-avalon-excalibur/event/dist/lib

prj-logger:

check-environment:

dependencies.servlet:

checkRequiredClass:

checkRequiredClass.fail:

dependencies.datasource:

checkRequiredClass:

checkRequiredClass.fail:

dependencies.jms:

dependencies.optional:

dependencies:

jms-warn:

op-warning:
     [echo] **********************************************
     [echo] *
     [echo] *  Classes needed for output via JMS are not 
     [echo] *  available.  Excalibur Logger should build without them
     [echo] *
     [echo] *  Recovery:
     [echo] *  Get jms.jar from inside jms-1_0_2b.zip from http://java.sun.com/products/jms/docs.html
and place it in ${lib.repo} (if defined), or set the ${jms.jar} property in ant.properties
     [echo] *
     [echo] ***********************************************


sql-warn:

mail-warn:

op-warning:
     [echo] **********************************************
     [echo] *
     [echo] *  Classes needed for output via SMTP are not 
     [echo] *  available.  Excalibur Logger should build without them
     [echo] *
     [echo] *  Recovery:
     [echo] *  Get mail.jar from inside javamail-1_2.zip from http://java.sun.com/products/javamail/
and place it in ${lib.repo} (if defined), or set the ${mail.jar} property in ant.properties
     [echo] *
     [echo] ***********************************************


log4j-warn:

servlet-warn:

optional-warnings:

compile:

prepare-conf:

jar:
      [jar] Building jar: /home/rubys/jakarta/jakarta-avalon-excalibur/logger/build/lib/excalibur-logger-1.0.jar

dist-jar:
    [mkdir] Created dir: /home/rubys/jakarta/jakarta-avalon-excalibur/logger/dist
     [copy] Copying 2 files to /home/rubys/jakarta/jakarta-avalon-excalibur/logger/dist

prj-sourceresolve:

dependencies:

compile:

prepare-conf:

jar:
      [jar] Building jar: /home/rubys/jakarta/jakarta-avalon-excalibur/sourceresolve/build/lib/excalibur-sourceresolve-1.0.jar

dist-jar:
    [mkdir] Created dir: /home/rubys/jakarta/jakarta-avalon-excalibur/sourceresolve/dist
     [copy] Copying 2 files to /home/rubys/jakarta/jakarta-avalon-excalibur/sourceresolve/dist

prj-monitor:

dependencies:

compile:
    [mkdir] Created dir: /home/rubys/jakarta/jakarta-avalon-excalibur/monitor/build/classes
    [javac] Compiling 17 source files to /home/rubys/jakarta/jakarta-avalon-excalibur/monitor/build/classes
    [javac] Note: /home/rubys/jakarta/jakarta-avalon-excalibur/monitor/src/java/org/apache/avalon/excalibur/monitor/Monitor.java
uses or overrides a deprecated API.
    [javac] Note: Recompile with -deprecation for details.

prepare-conf:
    [mkdir] Created dir: /home/rubys/jakarta/jakarta-avalon-excalibur/monitor/build/conf
     [copy] Copying 1 file to /home/rubys/jakarta/jakarta-avalon-excalibur/monitor/build/conf

jar:
    [mkdir] Created dir: /home/rubys/jakarta/jakarta-avalon-excalibur/monitor/build/lib
      [jar] Building jar: /home/rubys/jakarta/jakarta-avalon-excalibur/monitor/build/lib/excalibur-monitor-1.0.jar

dist-jar:
    [mkdir] Created dir: /home/rubys/jakarta/jakarta-avalon-excalibur/monitor/dist
     [copy] Copying 1 file to /home/rubys/jakarta/jakarta-avalon-excalibur/monitor/dist

prj-meta:

dependencies:

compile:

prepare-conf:

jar:
      [jar] Building jar: /home/rubys/jakarta/jakarta-avalon-excalibur/meta/build/lib/excalibur-meta-1.0.jar

dist-jar:
    [mkdir] Created dir: /home/rubys/jakarta/jakarta-avalon-excalibur/meta/dist
     [copy] Copying 2 files to /home/rubys/jakarta/jakarta-avalon-excalibur/meta/dist

prj-util:

dependencies:

compile:

prepare-conf:

jar:
      [jar] Building jar: /home/rubys/jakarta/jakarta-avalon-excalibur/util/build/lib/excalibur-util-1.0.jar

dist-jar:
    [mkdir] Created dir: /home/rubys/jakarta/jakarta-avalon-excalibur/util/dist
     [copy] Copying 2 files to /home/rubys/jakarta/jakarta-avalon-excalibur/util/dist

prj-assembly:

dependencies:

compile:

prepare-conf:

jar:
      [jar] Building jar: /home/rubys/jakarta/jakarta-avalon-excalibur/assembly/build/lib/merlin-2.0a.jar

dist-jar:
    [mkdir] Created dir: /home/rubys/jakarta/jakarta-avalon-excalibur/assembly/dist
     [copy] Copying 3 files to /home/rubys/jakarta/jakarta-avalon-excalibur/assembly/dist

prj-instrument-manager:

dependencies:

compile:

prepare-conf:

jar:
      [jar] Building jar: /home/rubys/jakarta/jakarta-avalon-excalibur/instrument-manager/build/lib/excalibur-instrument-manager-0.3.jar
      [jar] Building jar: /home/rubys/jakarta/jakarta-avalon-excalibur/instrument-manager/build/lib/excalibur-instrument-manager-interfaces-0.3.jar

dist-jar:
    [mkdir] Created dir: /home/rubys/jakarta/jakarta-avalon-excalibur/instrument-manager/dist
     [copy] Copying 4 files to /home/rubys/jakarta/jakarta-avalon-excalibur/instrument-manager/dist

prj-fortress:
Caught exception (org.apache.tools.ant.BuildException) while expanding tools.class.path: /home/rubys/jakarta/jakarta-avalon-excalibur/fortress/${tools.dir}/lib
not found.

optional.dependencies:

dependencies:

path-with-meta:

path-without-meta:

path-builder:

compile:
    [mkdir] Created dir: /home/rubys/jakarta/jakarta-avalon-excalibur/fortress/build/classes
    [javac] Compiling 34 source files to /home/rubys/jakarta/jakarta-avalon-excalibur/fortress/build/classes
    [javac] Note: Some input files use or override a deprecated API.
    [javac] Note: Recompile with -deprecation for details.
    [javac] Compiling 6 source files to /home/rubys/jakarta/jakarta-avalon-excalibur/fortress/build/classes

prepare-conf:
    [mkdir] Created dir: /home/rubys/jakarta/jakarta-avalon-excalibur/fortress/build/conf
     [copy] Copying 1 file to /home/rubys/jakarta/jakarta-avalon-excalibur/fortress/build/conf

jar:
    [mkdir] Created dir: /home/rubys/jakarta/jakarta-avalon-excalibur/fortress/build/lib
      [jar] Building jar: /home/rubys/jakarta/jakarta-avalon-excalibur/fortress/build/lib/excalibur-fortress-1.0.jar

copy-optional-libs:

big-jar:
     [copy] Copying 1 file to /home/rubys/jakarta/jakarta-avalon-excalibur/fortress/build/tempjars
     [copy] Copying 1 file to /home/rubys/jakarta/jakarta-avalon-excalibur/fortress/build/tempjars
     [copy] Copying 1 file to /home/rubys/jakarta/jakarta-avalon-excalibur/fortress/build/tempjars
     [copy] Copying 1 file to /home/rubys/jakarta/jakarta-avalon-excalibur/fortress/build/tempjars
     [copy] Copying 1 file to /home/rubys/jakarta/jakarta-avalon-excalibur/fortress/build/tempjars
     [copy] Copying 1 file to /home/rubys/jakarta/jakarta-avalon-excalibur/fortress/build/tempjars
     [copy] Copying 1 file to /home/rubys/jakarta/jakarta-avalon-excalibur/fortress/build/tempjars
     [copy] Copying 1 file to /home/rubys/jakarta/jakarta-avalon-excalibur/fortress/build/tempjars
     [copy] Copying 1 file to /home/rubys/jakarta/jakarta-avalon-excalibur/fortress/build/tempjars
     [copy] Copying 1 file to /home/rubys/jakarta/jakarta-avalon-excalibur/fortress/build/tempjars
     [copy] Copying 1 file to /home/rubys/jakarta/jakarta-avalon-excalibur/fortress/build/tempjars
     [copy] Copying 1 file to /home/rubys/jakarta/jakarta-avalon-excalibur/fortress/build/tempjars
     [copy] Copying 1 file to /home/rubys/jakarta/jakarta-avalon-excalibur/fortress/build/tempjars
     [copy] Copying 1 file to /home/rubys/jakarta/jakarta-avalon-excalibur/fortress/build/tempjars
     [copy] Copying 1 file to /home/rubys/jakarta/jakarta-avalon-excalibur/fortress/build/tempjars
     [copy] Copying 1 file to /home/rubys/jakarta/jakarta-avalon-excalibur/fortress/build/tempjars
      [jar] Building jar: /home/rubys/jakarta/jakarta-avalon-excalibur/fortress/build/lib/excalibur-fortress-complete-1.0.jar

dist-jar:
    [mkdir] Created dir: /home/rubys/jakarta/jakarta-avalon-excalibur/fortress/dist
     [copy] Copying 2 files to /home/rubys/jakarta/jakarta-avalon-excalibur/fortress/dist

prj-datasource:

check-environment:

check-datasource:

filter-jdbc:

nofilter-jdbc:

prepare-jdbc:

prepare:

dependencies:

compile:

prepare-conf:

jar:
      [jar] Building jar: /home/rubys/jakarta/jakarta-avalon-excalibur/datasource/build/lib/excalibur-datasource-1.0.jar
      [jar] Building jar: /home/rubys/jakarta/jakarta-avalon-excalibur/datasource/build/lib/excalibur-datasource-cluster-1.0a.jar
      [jar] Building jar: /home/rubys/jakarta/jakarta-avalon-excalibur/datasource/build/lib/excalibur-datasource-ids-1.0a.jar

dist-jar:
    [mkdir] Created dir: /home/rubys/jakarta/jakarta-avalon-excalibur/datasource/dist
     [copy] Copying 6 files to /home/rubys/jakarta/jakarta-avalon-excalibur/datasource/dist

prj-store:

dependencies:

compile:

prepare-conf:

jar:
      [jar] Building jar: /home/rubys/jakarta/jakarta-avalon-excalibur/store/build/lib/excalibur-store-1.0.jar

dist-jar:
    [mkdir] Created dir: /home/rubys/jakarta/jakarta-avalon-excalibur/store/dist
     [copy] Copying 2 files to /home/rubys/jakarta/jakarta-avalon-excalibur/store/dist

prj-policy:

dependencies:

compile:
    [mkdir] Created dir: /home/rubys/jakarta/jakarta-avalon-excalibur/policy/build/classes
    [javac] Compiling 11 source files to /home/rubys/jakarta/jakarta-avalon-excalibur/policy/build/classes
     [copy] Copying 2 files to /home/rubys/jakarta/jakarta-avalon-excalibur/policy/build/classes

prepare-conf:
    [mkdir] Created dir: /home/rubys/jakarta/jakarta-avalon-excalibur/policy/build/conf
     [copy] Copying 1 file to /home/rubys/jakarta/jakarta-avalon-excalibur/policy/build/conf

jar:
    [mkdir] Created dir: /home/rubys/jakarta/jakarta-avalon-excalibur/policy/build/lib
      [jar] Building jar: /home/rubys/jakarta/jakarta-avalon-excalibur/policy/build/lib/excalibur-policy-1.0a.jar

dist-jar:
    [mkdir] Created dir: /home/rubys/jakarta/jakarta-avalon-excalibur/policy/dist
     [copy] Copying 1 file to /home/rubys/jakarta/jakarta-avalon-excalibur/policy/dist

prj-component:

check-environment:

dependencies.servlet:

checkRequiredClass:

checkRequiredClass.fail:

dependencies.optional:

dependencies:

servlet-warn:

compile:
    [javac] Compiling 10 source files to /home/rubys/jakarta/jakarta-avalon-excalibur/component/build/classes
    [javac] Note: Some input files use or override a deprecated API.
    [javac] Note: Recompile with -deprecation for details.

prepare-conf:

jar-servlet:
      [jar] Building jar: /home/rubys/jakarta/jakarta-avalon-excalibur/component/build/lib/excalibur-component-servlet-1.0.jar

jar:
      [jar] Building jar: /home/rubys/jakarta/jakarta-avalon-excalibur/component/build/lib/excalibur-component-1.0.jar

dist-jar:
    [mkdir] Created dir: /home/rubys/jakarta/jakarta-avalon-excalibur/component/dist
     [copy] Copying 3 files to /home/rubys/jakarta/jakarta-avalon-excalibur/component/dist

prj-testcase:

dependencies:

compile:

prepare-conf:

jar:
      [jar] Building jar: /home/rubys/jakarta/jakarta-avalon-excalibur/testcase/build/lib/excalibur-testcase-1.0.jar

dist-jar:
    [mkdir] Created dir: /home/rubys/jakarta/jakarta-avalon-excalibur/testcase/dist
     [copy] Copying 2 files to /home/rubys/jakarta/jakarta-avalon-excalibur/testcase/dist

prj-xmlutil:

dependencies:

check-environment:

compile:
    [javac] Compiling 1 source file to /home/rubys/jakarta/jakarta-avalon-excalibur/xmlutil/build/classes
    [javac] Note: /home/rubys/jakarta/jakarta-avalon-excalibur/xmlutil/src/java/org/apache/avalon/excalibur/xml/xpath/JaxenProcessorImpl.java
uses or overrides a deprecated API.
    [javac] Note: Recompile with -deprecation for details.

prepare-conf:

jar:
      [jar] Building jar: /home/rubys/jakarta/jakarta-avalon-excalibur/xmlutil/build/lib/excalibur-xmlutil-1.0.jar

dist-jar:
    [mkdir] Created dir: /home/rubys/jakarta/jakarta-avalon-excalibur/xmlutil/dist
     [copy] Copying 2 files to /home/rubys/jakarta/jakarta-avalon-excalibur/xmlutil/dist

prj-instrument-client:

dependencies:

compile:
    [mkdir] Created dir: /home/rubys/jakarta/jakarta-avalon-excalibur/instrument-client/build/classes
    [javac] Compiling 23 source files to /home/rubys/jakarta/jakarta-avalon-excalibur/instrument-client/build/classes
     [copy] Copying 32 files to /home/rubys/jakarta/jakarta-avalon-excalibur/instrument-client/build/classes

prepare-conf:
    [mkdir] Created dir: /home/rubys/jakarta/jakarta-avalon-excalibur/instrument-client/build/conf
     [copy] Copying 1 file to /home/rubys/jakarta/jakarta-avalon-excalibur/instrument-client/build/conf

altrmiproxies:

altrmiproxies:
    [mkdir] Created dir: /home/rubys/jakarta/jakarta-avalon-excalibur/instrument-client/build/genjava
[altrmiproxies] --> ncdfe org/apache/commons/attributes/Attributes
[altrmiproxies] java.lang.NoClassDefFoundError: org/apache/commons/attributes/Attributes
[altrmiproxies] 	at org.apache.excalibur.altrmi.server.AttributeHelper.isMethodAsync(AttributeHelper.java:19)
[altrmiproxies] 	at org.apache.excalibur.altrmi.server.PublicationDescriptionItem.<init>(PublicationDescriptionItem.java:40)
[altrmiproxies] 	at org.apache.excalibur.altrmi.generator.ant.AltrmiProxyTask.execute(AltrmiProxyTask.java:264)
[altrmiproxies] 	at org.apache.tools.ant.UnknownElement.execute(UnknownElement.java:184)
[altrmiproxies] 	at org.apache.tools.ant.Task.perform(Task.java:348)
[altrmiproxies] 	at org.apache.tools.ant.Target.execute(Target.java:309)
[altrmiproxies] 	at org.apache.tools.ant.Target.performTasks(Target.java:336)
[altrmiproxies] 	at org.apache.tools.ant.Project.executeTarget(Project.java:1314)
[altrmiproxies] 	at org.apache.tools.ant.taskdefs.Ant.execute(Ant.java:373)
[altrmiproxies] 	at org.apache.tools.ant.UnknownElement.execute(UnknownElement.java:184)
[altrmiproxies] 	at org.apache.tools.ant.Task.perform(Task.java:348)
[altrmiproxies] 	at org.apache.tools.ant.Target.execute(Target.java:309)
[altrmiproxies] 	at org.apache.tools.ant.Target.performTasks(Target.java:336)
[altrmiproxies] 	at org.apache.tools.ant.Project.executeTarget(Project.java:1314)
[altrmiproxies] 	at org.apache.tools.ant.taskdefs.Ant.execute(Ant.java:373)
[altrmiproxies] 	at org.apache.tools.ant.UnknownElement.execute(UnknownElement.java:184)
[altrmiproxies] 	at org.apache.tools.ant.Task.perform(Task.java:348)
[altrmiproxies] 	at org.apache.tools.ant.Target.execute(Target.java:309)
[altrmiproxies] 	at org.apache.tools.ant.Target.performTasks(Target.java:336)
[altrmiproxies] 	at org.apache.tools.ant.Project.executeTarget(Project.java:1314)
[altrmiproxies] 	at org.apache.tools.ant.taskdefs.Ant.execute(Ant.java:373)
[altrmiproxies] 	at org.apache.tools.ant.UnknownElement.execute(UnknownElement.java:184)
[altrmiproxies] 	at org.apache.tools.ant.Task.perform(Task.java:348)
[altrmiproxies] 	at org.apache.tools.ant.Target.execute(Target.java:309)
[altrmiproxies] 	at org.apache.tools.ant.Target.performTasks(Target.java:336)
[altrmiproxies] 	at org.apache.tools.ant.Project.executeTarget(Project.java:1314)
[altrmiproxies] 	at org.apache.tools.ant.Project.executeTargets(Project.java:1258)
[altrmiproxies] 	at org.apache.tools.ant.Main.runBuild(Main.java:614)
[altrmiproxies] 	at org.apache.tools.ant.Main.start(Main.java:197)
[altrmiproxies] 	at org.apache.tools.ant.Main.main(Main.java:235)
[altrmiproxies] --> ncdfe org/apache/commons/attributes/Attributes
[altrmiproxies] java.lang.NoClassDefFoundError: org/apache/commons/attributes/Attributes
[altrmiproxies] 	at org.apache.excalibur.altrmi.server.AttributeHelper.isMethodAsync(AttributeHelper.java:19)
[altrmiproxies] 	at org.apache.excalibur.altrmi.server.PublicationDescriptionItem.<init>(PublicationDescriptionItem.java:40)
[altrmiproxies] 	at org.apache.excalibur.altrmi.generator.ant.AltrmiProxyTask.execute(AltrmiProxyTask.java:277)
[altrmiproxies] 	at org.apache.tools.ant.UnknownElement.execute(UnknownElement.java:184)
[altrmiproxies] 	at org.apache.tools.ant.Task.perform(Task.java:348)
[altrmiproxies] 	at org.apache.tools.ant.Target.execute(Target.java:309)
[altrmiproxies] 	at org.apache.tools.ant.Target.performTasks(Target.java:336)
[altrmiproxies] 	at org.apache.tools.ant.Project.executeTarget(Project.java:1314)
[altrmiproxies] 	at org.apache.tools.ant.taskdefs.Ant.execute(Ant.java:373)
[altrmiproxies] 	at org.apache.tools.ant.UnknownElement.execute(UnknownElement.java:184)
[altrmiproxies] 	at org.apache.tools.ant.Task.perform(Task.java:348)
[altrmiproxies] 	at org.apache.tools.ant.Target.execute(Target.java:309)
[altrmiproxies] 	at org.apache.tools.ant.Target.performTasks(Target.java:336)
[altrmiproxies] 	at org.apache.tools.ant.Project.executeTarget(Project.java:1314)
[altrmiproxies] 	at org.apache.tools.ant.taskdefs.Ant.execute(Ant.java:373)
[altrmiproxies] 	at org.apache.tools.ant.UnknownElement.execute(UnknownElement.java:184)
[altrmiproxies] 	at org.apache.tools.ant.Task.perform(Task.java:348)
[altrmiproxies] 	at org.apache.tools.ant.Target.execute(Target.java:309)
[altrmiproxies] 	at org.apache.tools.ant.Target.performTasks(Target.java:336)
[altrmiproxies] 	at org.apache.tools.ant.Project.executeTarget(Project.java:1314)
[altrmiproxies] 	at org.apache.tools.ant.taskdefs.Ant.execute(Ant.java:373)
[altrmiproxies] 	at org.apache.tools.ant.UnknownElement.execute(UnknownElement.java:184)
[altrmiproxies] 	at org.apache.tools.ant.Task.perform(Task.java:348)
[altrmiproxies] 	at org.apache.tools.ant.Target.execute(Target.java:309)
[altrmiproxies] 	at org.apache.tools.ant.Target.performTasks(Target.java:336)
[altrmiproxies] 	at org.apache.tools.ant.Project.executeTarget(Project.java:1314)
[altrmiproxies] 	at org.apache.tools.ant.Project.executeTargets(Project.java:1258)
[altrmiproxies] 	at org.apache.tools.ant.Main.runBuild(Main.java:614)
[altrmiproxies] 	at org.apache.tools.ant.Main.start(Main.java:197)
[altrmiproxies] 	at org.apache.tools.ant.Main.main(Main.java:235)
[altrmiproxies] --> ncdfe org/apache/commons/attributes/Attributes
[altrmiproxies] java.lang.NoClassDefFoundError: org/apache/commons/attributes/Attributes
[altrmiproxies] 	at org.apache.excalibur.altrmi.server.AttributeHelper.isMethodAsync(AttributeHelper.java:19)
[altrmiproxies] 	at org.apache.excalibur.altrmi.server.PublicationDescriptionItem.<init>(PublicationDescriptionItem.java:40)
[altrmiproxies] 	at org.apache.excalibur.altrmi.generator.ant.AltrmiProxyTask.execute(AltrmiProxyTask.java:277)
[altrmiproxies] 	at org.apache.tools.ant.UnknownElement.execute(UnknownElement.java:184)
[altrmiproxies] 	at org.apache.tools.ant.Task.perform(Task.java:348)
[altrmiproxies] 	at org.apache.tools.ant.Target.execute(Target.java:309)
[altrmiproxies] 	at org.apache.tools.ant.Target.performTasks(Target.java:336)
[altrmiproxies] 	at org.apache.tools.ant.Project.executeTarget(Project.java:1314)
[altrmiproxies] 	at org.apache.tools.ant.taskdefs.Ant.execute(Ant.java:373)
[altrmiproxies] 	at org.apache.tools.ant.UnknownElement.execute(UnknownElement.java:184)
[altrmiproxies] 	at org.apache.tools.ant.Task.perform(Task.java:348)
[altrmiproxies] 	at org.apache.tools.ant.Target.execute(Target.java:309)
[altrmiproxies] 	at org.apache.tools.ant.Target.performTasks(Target.java:336)
[altrmiproxies] 	at org.apache.tools.ant.Project.executeTarget(Project.java:1314)
[altrmiproxies] 	at org.apache.tools.ant.taskdefs.Ant.execute(Ant.java:373)
[altrmiproxies] 	at org.apache.tools.ant.UnknownElement.execute(UnknownElement.java:184)
[altrmiproxies] 	at org.apache.tools.ant.Task.perform(Task.java:348)
[altrmiproxies] 	at org.apache.tools.ant.Target.execute(Target.java:309)
[altrmiproxies] 	at org.apache.tools.ant.Target.performTasks(Target.java:336)
[altrmiproxies] 	at org.apache.tools.ant.Project.executeTarget(Project.java:1314)
[altrmiproxies] 	at org.apache.tools.ant.taskdefs.Ant.execute(Ant.java:373)
[altrmiproxies] 	at org.apache.tools.ant.UnknownElement.execute(UnknownElement.java:184)
[altrmiproxies] 	at org.apache.tools.ant.Task.perform(Task.java:348)
[altrmiproxies] 	at org.apache.tools.ant.Target.execute(Target.java:309)
[altrmiproxies] 	at org.apache.tools.ant.Target.performTasks(Target.java:336)
[altrmiproxies] 	at org.apache.tools.ant.Project.executeTarget(Project.java:1314)
[altrmiproxies] 	at org.apache.tools.ant.Project.executeTargets(Project.java:1258)
[altrmiproxies] 	at org.apache.tools.ant.Main.runBuild(Main.java:614)
[altrmiproxies] 	at org.apache.tools.ant.Main.start(Main.java:197)
[altrmiproxies] 	at org.apache.tools.ant.Main.main(Main.java:235)
[altrmiproxies] --> ncdfe org/apache/commons/attributes/Attributes
[altrmiproxies] java.lang.NoClassDefFoundError: org/apache/commons/attributes/Attributes
[altrmiproxies] 	at org.apache.excalibur.altrmi.server.AttributeHelper.isMethodAsync(AttributeHelper.java:19)
[altrmiproxies] 	at org.apache.excalibur.altrmi.server.PublicationDescriptionItem.<init>(PublicationDescriptionItem.java:40)
[altrmiproxies] 	at org.apache.excalibur.altrmi.generator.ant.AltrmiProxyTask.execute(AltrmiProxyTask.java:277)
[altrmiproxies] 	at org.apache.tools.ant.UnknownElement.execute(UnknownElement.java:184)
[altrmiproxies] 	at org.apache.tools.ant.Task.perform(Task.java:348)
[altrmiproxies] 	at org.apache.tools.ant.Target.execute(Target.java:309)
[altrmiproxies] 	at org.apache.tools.ant.Target.performTasks(Target.java:336)
[altrmiproxies] 	at org.apache.tools.ant.Project.executeTarget(Project.java:1314)
[altrmiproxies] 	at org.apache.tools.ant.taskdefs.Ant.execute(Ant.java:373)
[altrmiproxies] 	at org.apache.tools.ant.UnknownElement.execute(UnknownElement.java:184)
[altrmiproxies] 	at org.apache.tools.ant.Task.perform(Task.java:348)
[altrmiproxies] 	at org.apache.tools.ant.Target.execute(Target.java:309)
[altrmiproxies] 	at org.apache.tools.ant.Target.performTasks(Target.java:336)
[altrmiproxies] 	at org.apache.tools.ant.Project.executeTarget(Project.java:1314)
[altrmiproxies] 	at org.apache.tools.ant.taskdefs.Ant.execute(Ant.java:373)
[altrmiproxies] 	at org.apache.tools.ant.UnknownElement.execute(UnknownElement.java:184)
[altrmiproxies] 	at org.apache.tools.ant.Task.perform(Task.java:348)
[altrmiproxies] 	at org.apache.tools.ant.Target.execute(Target.java:309)
[altrmiproxies] 	at org.apache.tools.ant.Target.performTasks(Target.java:336)
[altrmiproxies] 	at org.apache.tools.ant.Project.executeTarget(Project.java:1314)
[altrmiproxies] 	at org.apache.tools.ant.taskdefs.Ant.execute(Ant.java:373)
[altrmiproxies] 	at org.apache.tools.ant.UnknownElement.execute(UnknownElement.java:184)
[altrmiproxies] 	at org.apache.tools.ant.Task.perform(Task.java:348)
[altrmiproxies] 	at org.apache.tools.ant.Target.execute(Target.java:309)
[altrmiproxies] 	at org.apache.tools.ant.Target.performTasks(Target.java:336)
[altrmiproxies] 	at org.apache.tools.ant.Project.executeTarget(Project.java:1314)
[altrmiproxies] 	at org.apache.tools.ant.Project.executeTargets(Project.java:1258)
[altrmiproxies] 	at org.apache.tools.ant.Main.runBuild(Main.java:614)
[altrmiproxies] 	at org.apache.tools.ant.Main.start(Main.java:197)
[altrmiproxies] 	at org.apache.tools.ant.Main.main(Main.java:235)
[altrmiproxies] Note: sun.tools.javac.Main has been deprecated.
[altrmiproxies] 1 warning
[altrmiproxies] Note: sun.tools.javac.Main has been deprecated.
[altrmiproxies] 1 warning


jar:
    [mkdir] Created dir: /home/rubys/jakarta/jakarta-avalon-excalibur/instrument-client/build/lib
      [jar] Building jar: /home/rubys/jakarta/jakarta-avalon-excalibur/instrument-client/build/lib/excalibur-instrument-client-0.3.jar

dist-jar:
    [mkdir] Created dir: /home/rubys/jakarta/jakarta-avalon-excalibur/instrument-client/dist
    [mkdir] Created dir: /home/rubys/jakarta/jakarta-avalon-excalibur/instrument-client/dist/bin
    [mkdir] Created dir: /home/rubys/jakarta/jakarta-avalon-excalibur/instrument-client/dist/conf
    [mkdir] Created dir: /home/rubys/jakarta/jakarta-avalon-excalibur/instrument-client/dist/lib
     [copy] Copying 3 files to /home/rubys/jakarta/jakarta-avalon-excalibur/instrument-client/dist/bin
     [copy] Copying 1 file to /home/rubys/jakarta/jakarta-avalon-excalibur/instrument-client/dist/conf
     [copy] Copying 1 file to /home/rubys/jakarta/jakarta-avalon-excalibur/instrument-client/dist/lib
     [copy] Copying 1 file to /home/rubys/jakarta/jakarta-avalon-excalibur/instrument-client/dist/lib
     [copy] Copying 1 file to /home/rubys/jakarta/jakarta-avalon-excalibur/instrument-client/dist/lib
     [copy] Copying 1 file to /home/rubys/jakarta/jakarta-avalon-excalibur/instrument-client/dist/lib
     [copy] Copying 1 file to /home/rubys/jakarta/jakarta-avalon-excalibur/instrument-client/dist/lib
     [copy] Copying 1 file to /home/rubys/jakarta/jakarta-avalon-excalibur/instrument-client/dist/lib
     [copy] Copying 1 file to /home/rubys/jakarta/jakarta-avalon-excalibur/instrument-client/dist/lib
     [copy] Copying 1 file to /home/rubys/jakarta/jakarta-avalon-excalibur/instrument-client/dist/lib
     [copy] Copying 1 file to /home/rubys/jakarta/jakarta-avalon-excalibur/instrument-client/dist/lib

build-all-subprojects:
    [jlink] linking:     /home/rubys/jakarta/jakarta-avalon-excalibur/avalon-excalibur-tmpA.jar
    [jlink] linking:     /home/rubys/jakarta/jakarta-avalon-excalibur/avalon-excalibur-tmpB.jar
    [jlink] linking:     /home/rubys/jakarta/jakarta-avalon-excalibur/avalon-excalibur-tmpAB.jar
      [jar] Building jar: /home/rubys/jakarta/jakarta-avalon-excalibur/avalon-excalibur.jar
   [delete] Deleting: /home/rubys/jakarta/jakarta-avalon-excalibur/avalon-excalibur-tmpA.jar
   [delete] Deleting: /home/rubys/jakarta/jakarta-avalon-excalibur/avalon-excalibur-tmpB.jar
   [delete] Deleting: /home/rubys/jakarta/jakarta-avalon-excalibur/avalon-excalibur-tmpAB.jar

build-subprojects-dist:

prj-zip:

dependencies:

compile:

prepare-conf:

jar:

dist-jar:

dependencies-test:

compile-test:
    [mkdir] Created dir: /home/rubys/jakarta/jakarta-avalon-excalibur/zip/build/testsrc
     [copy] Copying 5 files to /home/rubys/jakarta/jakarta-avalon-excalibur/zip/build/testsrc
    [mkdir] Created dir: /home/rubys/jakarta/jakarta-avalon-excalibur/zip/build/testclasses
    [javac] Compiling 5 source files to /home/rubys/jakarta/jakarta-avalon-excalibur/zip/build/testclasses
    [javac] Note: Some input files use or override a deprecated API.
    [javac] Note: Recompile with -deprecation for details.

test:
     [echo] Performing Unit Tests
    [mkdir] Created dir: /home/rubys/jakarta/jakarta-avalon-excalibur/zip/build/tests
    [junit] Running org.apache.excalibur.zip.test.ZipEntryTestCase
    [junit] Tests run: 1, Failures: 0, Errors: 1, Time elapsed: 0 sec
    [junit] Testsuite: org.apache.excalibur.zip.test.ZipEntryTestCase
    [junit] Tests run: 1, Failures: 0, Errors: 1, Time elapsed: 0 sec

    [junit] 	Caused an ERROR
    [junit] org.apache.excalibur.zip.test.ZipEntryTestCase
    [junit] java.lang.ClassNotFoundException: org.apache.excalibur.zip.test.ZipEntryTestCase
    [junit] 	at java.net.URLClassLoader$1.run(URLClassLoader.java:198)
    [junit] 	at java.security.AccessController.doPrivileged(Native Method)
    [junit] 	at java.net.URLClassLoader.findClass(URLClassLoader.java:186)
    [junit] 	at java.lang.ClassLoader.loadClass(ClassLoader.java:299)
    [junit] 	at sun.misc.Launcher$AppClassLoader.loadClass(Launcher.java:265)
    [junit] 	at java.lang.ClassLoader.loadClass(ClassLoader.java:255)
    [junit] 	at java.lang.ClassLoader.loadClassInternal(ClassLoader.java:315)
    [junit] 	at java.lang.Class.forName0(Native Method)
    [junit] 	at java.lang.Class.forName(Class.java:140)

    [junit] TEST org.apache.excalibur.zip.test.ZipEntryTestCase FAILED
    [junit] Running org.apache.excalibur.zip.test.AsiExtraFieldTestCase
    [junit] Tests run: 1, Failures: 0, Errors: 1, Time elapsed: 0 sec
    [junit] Testsuite: org.apache.excalibur.zip.test.AsiExtraFieldTestCase
    [junit] Tests run: 1, Failures: 0, Errors: 1, Time elapsed: 0 sec

    [junit] 	Caused an ERROR
    [junit] org.apache.excalibur.zip.test.AsiExtraFieldTestCase
    [junit] java.lang.ClassNotFoundException: org.apache.excalibur.zip.test.AsiExtraFieldTestCase
    [junit] 	at java.net.URLClassLoader$1.run(URLClassLoader.java:198)
    [junit] 	at java.security.AccessController.doPrivileged(Native Method)
    [junit] 	at java.net.URLClassLoader.findClass(URLClassLoader.java:186)
    [junit] 	at java.lang.ClassLoader.loadClass(ClassLoader.java:299)
    [junit] 	at sun.misc.Launcher$AppClassLoader.loadClass(Launcher.java:265)
    [junit] 	at java.lang.ClassLoader.loadClass(ClassLoader.java:255)
    [junit] 	at java.lang.ClassLoader.loadClassInternal(ClassLoader.java:315)
    [junit] 	at java.lang.Class.forName0(Native Method)
    [junit] 	at java.lang.Class.forName(Class.java:140)

    [junit] TEST org.apache.excalibur.zip.test.AsiExtraFieldTestCase FAILED
    [junit] Running org.apache.excalibur.zip.test.ZipShortTestCase
    [junit] Tests run: 1, Failures: 0, Errors: 1, Time elapsed: 0 sec
    [junit] Testsuite: org.apache.excalibur.zip.test.ZipShortTestCase
    [junit] Tests run: 1, Failures: 0, Errors: 1, Time elapsed: 0 sec

    [junit] 	Caused an ERROR
    [junit] org.apache.excalibur.zip.test.ZipShortTestCase
    [junit] java.lang.ClassNotFoundException: org.apache.excalibur.zip.test.ZipShortTestCase
    [junit] 	at java.net.URLClassLoader$1.run(URLClassLoader.java:198)
    [junit] 	at java.security.AccessController.doPrivileged(Native Method)
    [junit] 	at java.net.URLClassLoader.findClass(URLClassLoader.java:186)
    [junit] 	at java.lang.ClassLoader.loadClass(ClassLoader.java:299)
    [junit] 	at sun.misc.Launcher$AppClassLoader.loadClass(Launcher.java:265)
    [junit] 	at java.lang.ClassLoader.loadClass(ClassLoader.java:255)
    [junit] 	at java.lang.ClassLoader.loadClassInternal(ClassLoader.java:315)
    [junit] 	at java.lang.Class.forName0(Native Method)
    [junit] 	at java.lang.Class.forName(Class.java:140)

    [junit] TEST org.apache.excalibur.zip.test.ZipShortTestCase FAILED
    [junit] Running org.apache.excalibur.zip.test.ExtraFieldUtilsTestCase
    [junit] Tests run: 1, Failures: 0, Errors: 1, Time elapsed: 0 sec
    [junit] Testsuite: org.apache.excalibur.zip.test.ExtraFieldUtilsTestCase
    [junit] Tests run: 1, Failures: 0, Errors: 1, Time elapsed: 0 sec

    [junit] 	Caused an ERROR
    [junit] org.apache.excalibur.zip.test.ExtraFieldUtilsTestCase
    [junit] java.lang.ClassNotFoundException: org.apache.excalibur.zip.test.ExtraFieldUtilsTestCase
    [junit] 	at java.net.URLClassLoader$1.run(URLClassLoader.java:198)
    [junit] 	at java.security.AccessController.doPrivileged(Native Method)
    [junit] 	at java.net.URLClassLoader.findClass(URLClassLoader.java:186)
    [junit] 	at java.lang.ClassLoader.loadClass(ClassLoader.java:299)
    [junit] 	at sun.misc.Launcher$AppClassLoader.loadClass(Launcher.java:265)
    [junit] 	at java.lang.ClassLoader.loadClass(ClassLoader.java:255)
    [junit] 	at java.lang.ClassLoader.loadClassInternal(ClassLoader.java:315)
    [junit] 	at java.lang.Class.forName0(Native Method)
    [junit] 	at java.lang.Class.forName(Class.java:140)

    [junit] TEST org.apache.excalibur.zip.test.ExtraFieldUtilsTestCase FAILED
    [junit] Running org.apache.excalibur.zip.test.ZipLongTestCase
    [junit] Tests run: 1, Failures: 0, Errors: 1, Time elapsed: 0 sec
    [junit] Testsuite: org.apache.excalibur.zip.test.ZipLongTestCase
    [junit] Tests run: 1, Failures: 0, Errors: 1, Time elapsed: 0 sec

    [junit] 	Caused an ERROR
    [junit] org.apache.excalibur.zip.test.ZipLongTestCase
    [junit] java.lang.ClassNotFoundException: org.apache.excalibur.zip.test.ZipLongTestCase
    [junit] 	at java.net.URLClassLoader$1.run(URLClassLoader.java:198)
    [junit] 	at java.security.AccessController.doPrivileged(Native Method)
    [junit] 	at java.net.URLClassLoader.findClass(URLClassLoader.java:186)
    [junit] 	at java.lang.ClassLoader.loadClass(ClassLoader.java:299)
    [junit] 	at sun.misc.Launcher$AppClassLoader.loadClass(Launcher.java:265)
    [junit] 	at java.lang.ClassLoader.loadClass(ClassLoader.java:255)
    [junit] 	at java.lang.ClassLoader.loadClassInternal(ClassLoader.java:315)
    [junit] 	at java.lang.Class.forName0(Native Method)
    [junit] 	at java.lang.Class.forName(Class.java:140)

    [junit] TEST org.apache.excalibur.zip.test.ZipLongTestCase FAILED

test-reports:

checkBSF:

checkRequiredClass:

checkRequiredClass.fail:
    [mkdir] Created dir: /home/rubys/jakarta/jakarta-avalon-excalibur/zip/build/reports/junit
[junitreport] Using Xalan version: Xalan Java 2.4.1
[junitreport] Transform time: 2093ms

checkstyle:

checkstyle-report:

javadocs:
    [mkdir] Created dir: /home/rubys/jakarta/jakarta-avalon-excalibur/zip/dist/docs/api
  [javadoc] Generating Javadoc
  [javadoc] Javadoc execution
  [javadoc] Loading source files for package org.apache.excalibur.zip...
  [javadoc] Constructing Javadoc information...
  [javadoc] Standard Doclet version 1.4.1

  [javadoc] Building tree for all the packages and classes...
  [javadoc] Building index for all the packages and classes...
  [javadoc] Building index for all classes...

anakia-avail:

anakia-check:

docs:
   [anakia] Transforming into: /home/rubys/jakarta/jakarta-avalon-excalibur/zip/dist/docs
   [anakia] Error: org.apache.velocity.exception.ResourceNotFoundException: Unable to find
resource 'docs.vsl'

BUILD FAILED
file:///home/rubys/jakarta/jakarta-avalon-excalibur/zip/build.xml:326: org.apache.velocity.exception.ResourceNotFoundException:
Unable to find resource 'docs.vsl'

Total time: 47 seconds

--
To unsubscribe, e-mail:   <mailto:avalon-dev-unsubscribe@jakarta.apache.org>
For additional commands, e-mail: <mailto:avalon-dev-help@jakarta.apache.org>


Mime
View raw message