avalon-dev mailing list archives

Site index · List index
Message view « Date » · « Thread »
Top « Date » · « Thread »
From Peter Donald <pe...@apache.org>
Subject [GUMP] Build Failure - jakarta-avalon-excalibur
Date Thu, 18 Jul 2002 13:54:14 GMT
----------------------------------------------------
This email is autogenerated from the output from:
<http://jakarta.apache.org/builds/gump/2002-07-18/jakarta-avalon-excalibur.html>
----------------------------------------------------

build.sh: cd: /home/rubys/jakarta/jakarta-avalon-excalibur/all: No such file or directory
Buildfile: build.xml

build-subprojects-dist:

dependencies:

compile:

jar:

dist-jar:

dependencies-test:

compile-test:

test:
     [echo] Performing Unit Tests
    [mkdir] Created dir: /home/rubys/jakarta/jakarta-avalon-excalibur/altrmi/build/tests
    [junit] Running org.apache.excalibur.altrmi.test.generator.BCELProxyGeneratorTestCase
    [junit] Tests run: 1, Failures: 0, Errors: 1, Time elapsed: 0 sec
    [junit] Testsuite: org.apache.excalibur.altrmi.test.generator.BCELProxyGeneratorTestCase
    [junit] Tests run: 1, Failures: 0, Errors: 1, Time elapsed: 0 sec

    [junit] 	Caused an ERROR
    [junit] org.apache.excalibur.altrmi.test.generator.BCELProxyGeneratorTestCase
    [junit] java.lang.ClassNotFoundException: org.apache.excalibur.altrmi.test.generator.BCELProxyGeneratorTestCase
    [junit] 	at java.net.URLClassLoader$1.run(URLClassLoader.java:200)
    [junit] 	at java.security.AccessController.doPrivileged(Native Method)
    [junit] 	at java.net.URLClassLoader.findClass(URLClassLoader.java:188)
    [junit] 	at java.lang.ClassLoader.loadClass(ClassLoader.java:299)
    [junit] 	at sun.misc.Launcher$AppClassLoader.loadClass(Launcher.java:286)
    [junit] 	at java.lang.ClassLoader.loadClass(ClassLoader.java:255)
    [junit] 	at java.lang.ClassLoader.loadClassInternal(ClassLoader.java:315)
    [junit] 	at java.lang.Class.forName0(Native Method)
    [junit] 	at java.lang.Class.forName(Class.java:120)

    [junit] TEST org.apache.excalibur.altrmi.test.generator.BCELProxyGeneratorTestCase FAILED
    [junit] Running org.apache.excalibur.altrmi.test.piped.PipedTestCase
    [junit] Tests run: 1, Failures: 0, Errors: 1, Time elapsed: 0 sec
    [junit] Testsuite: org.apache.excalibur.altrmi.test.piped.PipedTestCase
    [junit] Tests run: 1, Failures: 0, Errors: 1, Time elapsed: 0 sec

    [junit] 	Caused an ERROR
    [junit] org.apache.excalibur.altrmi.test.piped.PipedTestCase
    [junit] java.lang.ClassNotFoundException: org.apache.excalibur.altrmi.test.piped.PipedTestCase
    [junit] 	at java.net.URLClassLoader$1.run(URLClassLoader.java:200)
    [junit] 	at java.security.AccessController.doPrivileged(Native Method)
    [junit] 	at java.net.URLClassLoader.findClass(URLClassLoader.java:188)
    [junit] 	at java.lang.ClassLoader.loadClass(ClassLoader.java:299)
    [junit] 	at sun.misc.Launcher$AppClassLoader.loadClass(Launcher.java:286)
    [junit] 	at java.lang.ClassLoader.loadClass(ClassLoader.java:255)
    [junit] 	at java.lang.ClassLoader.loadClassInternal(ClassLoader.java:315)
    [junit] 	at java.lang.Class.forName0(Native Method)
    [junit] 	at java.lang.Class.forName(Class.java:120)

    [junit] TEST org.apache.excalibur.altrmi.test.piped.PipedTestCase FAILED

test-reports:

checkBSF:

checkRequiredClass:

checkRequiredClass.fail:
    [mkdir] Created dir: /home/rubys/jakarta/jakarta-avalon-excalibur/altrmi/build/reports/junit
[junitreport] Using Xalan version: Xalan Java 2.4.D1
[junitreport] Transform time: 7256ms

checkstyle:

checkstyle-report:

javadocs:
    [mkdir] Created dir: /home/rubys/jakarta/jakarta-avalon-excalibur/altrmi/dist/docs/api
  [javadoc] Generating Javadoc
  [javadoc] Javadoc execution
  [javadoc] Loading source files for package org.apache.excalibur.altrmi.client...
  [javadoc] Loading source files for package org.apache.excalibur.altrmi.client.impl...
  [javadoc] Loading source files for package org.apache.excalibur.altrmi.client.impl.direct...
  [javadoc] Loading source files for package org.apache.excalibur.altrmi.client.impl.multiple...
  [javadoc] Loading source files for package org.apache.excalibur.altrmi.client.impl.naming...
  [javadoc] Loading source files for package org.apache.excalibur.altrmi.client.impl.piped...
  [javadoc] Loading source files for package org.apache.excalibur.altrmi.client.impl.rmi...
  [javadoc] Loading source files for package org.apache.excalibur.altrmi.client.impl.socket...
  [javadoc] Loading source files for package org.apache.excalibur.altrmi.client.impl.stream...
  [javadoc] Loading source files for package org.apache.excalibur.altrmi.client.impl.callback.socket...
  [javadoc] Loading source files for package org.apache.excalibur.altrmi.client.impl.callback.stream...
  [javadoc] Loading source files for package org.apache.excalibur.altrmi.common...
  [javadoc] Loading source files for package org.apache.excalibur.altrmi.generator...
  [javadoc] Loading source files for package org.apache.excalibur.altrmi.generator.ant...
  [javadoc] Loading source files for package org.apache.excalibur.altrmi.javacompiler...
  [javadoc] Loading source files for package org.apache.excalibur.altrmi.server...
  [javadoc] Loading source files for package org.apache.excalibur.altrmi.server.impl...
  [javadoc] Loading source files for package org.apache.excalibur.altrmi.server.impl.adapters...
  [javadoc] Loading source files for package org.apache.excalibur.altrmi.server.impl.classretrievers...
  [javadoc] Loading source files for package org.apache.excalibur.altrmi.server.impl.direct...
  [javadoc] Loading source files for package org.apache.excalibur.altrmi.server.impl.piped...
  [javadoc] Loading source files for package org.apache.excalibur.altrmi.server.impl.rmi...
  [javadoc] Loading source files for package org.apache.excalibur.altrmi.server.impl.socket...
  [javadoc] Loading source files for package org.apache.excalibur.altrmi.server.impl.callback...
  [javadoc] Loading source files for package org.apache.excalibur.altrmi.server.impl.callback.socket...
  [javadoc] Loading source files for package org.apache.excalibur.altrmi.server.impl.callback.stream...
  [javadoc] Constructing Javadoc information...
  [javadoc] javadoc: warning - Import not found: org.apache.bcel.Constants - ignoring!
  [javadoc] javadoc: warning - Import not found: org.apache.bcel.generic.ArrayType - ignoring!
  [javadoc] javadoc: warning - Import not found: org.apache.bcel.generic.BranchInstruction
- ignoring!
  [javadoc] javadoc: warning - Import not found: org.apache.bcel.generic.ClassGen - ignoring!
  [javadoc] javadoc: warning - Import not found: org.apache.bcel.generic.ConstantPoolGen -
ignoring!
  [javadoc] javadoc: warning - Import not found: org.apache.bcel.generic.FieldGen - ignoring!
  [javadoc] javadoc: warning - Import not found: org.apache.bcel.generic.INSTANCEOF - ignoring!
  [javadoc] javadoc: warning - Import not found: org.apache.bcel.generic.Instruction - ignoring!
  [javadoc] javadoc: warning - Import not found: org.apache.bcel.generic.InstructionConstants
- ignoring!
  [javadoc] javadoc: warning - Import not found: org.apache.bcel.generic.InstructionFactory
- ignoring!
  [javadoc] javadoc: warning - Import not found: org.apache.bcel.generic.InstructionHandle
- ignoring!
  [javadoc] javadoc: warning - Import not found: org.apache.bcel.generic.InstructionList -
ignoring!
  [javadoc] javadoc: warning - Import not found: org.apache.bcel.generic.MethodGen - ignoring!
  [javadoc] javadoc: warning - Import not found: org.apache.bcel.generic.ObjectType - ignoring!
  [javadoc] javadoc: warning - Import not found: org.apache.bcel.generic.PUSH - ignoring!
  [javadoc] javadoc: warning - Import not found: org.apache.bcel.generic.Type - ignoring!
  [javadoc] javadoc: warning - Cannot find class org.apache.bcel.generic.Type
  [javadoc] javadoc: warning - Cannot find class org.apache.bcel.generic.InstructionList
  [javadoc] Building tree for all the packages and classes...
  [javadoc] Building index for all the packages and classes...
  [javadoc] javadoc: warning - addToEnvironment: @return tag has no arguments.
  [javadoc] javadoc: warning - altrmiGetReferenceID: @return tag has no arguments.
  [javadoc] javadoc: warning - composeName: @return tag has no arguments.
  [javadoc] javadoc: warning - composeName: @return tag has no arguments.
  [javadoc] javadoc: warning - createClasspath: @return tag has no arguments.
  [javadoc] javadoc: warning - createSubcontext: @return tag has no arguments.
  [javadoc] javadoc: warning - createSubcontext: @return tag has no arguments.
  [javadoc] javadoc: warning - doCompile: @return tag has no arguments.
  [javadoc] javadoc: warning - encodeClassName: @return tag has no arguments.
  [javadoc] javadoc: warning - getAdditionalFacades: @return tag has no arguments.
  [javadoc] javadoc: warning - getAltrmiInterfaceLookup: @return tag has no arguments.
  [javadoc] javadoc: warning - getAltrmiInterfaceLookup: @return tag has no arguments.
  [javadoc] javadoc: warning - getAltrmiInterfaceLookup: @return tag has no arguments.
  [javadoc] javadoc: warning - getAltrmiInterfaceLookup: @return tag has no arguments.
  [javadoc] javadoc: warning - getAltrmiInterfaceLookup: @return tag has no arguments.
  [javadoc] javadoc: warning - getAltrmiInterfaceLookup: @return tag has no arguments.
  [javadoc] javadoc: warning - getAltrmiInterfaceLookup: @return tag has no arguments.
  [javadoc] javadoc: warning - getAltrmiInterfaceLookup: @return tag has no arguments.
  [javadoc] javadoc: warning - getBeanBytes: @return tag has no arguments.
  [javadoc] javadoc: warning - getClientInvocationHandler: @return tag has no arguments.
  [javadoc] javadoc: warning - getClientInvocationHandler: @return tag has no arguments.
  [javadoc] javadoc: warning - getClientInvocationHandler: @return tag has no arguments.
  [javadoc] javadoc: warning - getCompilerMessage: @return tag has no arguments.
  [javadoc] javadoc: warning - getCompilerPluginClass: @return tag has no arguments.
  [javadoc] javadoc: warning - getDefaultCompiler: @return tag has no arguments.
  [javadoc] javadoc: warning - getEnvironment: @return tag has no arguments.
  [javadoc] javadoc: warning - getImplObj: @return tag has no arguments.
  [javadoc] javadoc: warning - getInitialContext: @return tag has no arguments.
  [javadoc] javadoc: warning - getInstance: @return tag has no arguments.
  [javadoc] javadoc: warning - getInterfaceImplementationBytes: @return tag has no arguments.
  [javadoc] javadoc: warning - getInterfacesClassLoader: @return tag has no arguments.
  [javadoc] javadoc: warning - getInterfacesClassLoader: @return tag has no arguments.
  [javadoc] javadoc: warning - getInterfacesClassLoader: @return tag has no arguments.
  [javadoc] javadoc: warning - getInterfacesClassLoader: @return tag has no arguments.
  [javadoc] javadoc: warning - getInterfacesClassLoader: @return tag has no arguments.
  [javadoc] javadoc: warning - getInterfacesToExpose: @return tag has no arguments.
  [javadoc] javadoc: warning - getLastRealRequest: @return tag has no arguments.
  [javadoc] javadoc: warning - getLastRealRequest: @return tag has no arguments.
  [javadoc] javadoc: warning - getLastRealRequest: @return tag has no arguments.
  [javadoc] javadoc: warning - getLastRealRequest: @return tag has no arguments.
  [javadoc] javadoc: warning - getLastRealRequest: @return tag has no arguments.
  [javadoc] javadoc: warning - getLogger: @return tag has no arguments.
  [javadoc] javadoc: warning - getMethodInvocationHandler: @return tag has no arguments.
  [javadoc] javadoc: warning - getMethodInvocationHandler: @return tag has no arguments.
  [javadoc] javadoc: warning - getMethodInvocationHandler: @return tag has no arguments.
  [javadoc] javadoc: warning - getMethodInvocationHandler: @return tag has no arguments.
  [javadoc] javadoc: warning - getMethodInvocationHandler: @return tag has no arguments.
  [javadoc] javadoc: warning - getMethodInvocationHandler: @return tag has no arguments.
  [javadoc] javadoc: warning - getMostDerivedType: @return tag has no arguments.
  [javadoc] javadoc: warning - getMostDerivedType: @return tag has no arguments.
  [javadoc] javadoc: warning - getNameInNamespace: @return tag has no arguments.
  [javadoc] javadoc: warning - getNameParser: @return tag has no arguments.
  [javadoc] javadoc: warning - getNameParser: @return tag has no arguments.
  [javadoc] javadoc: warning - getReferenceID: @return tag has no arguments.
  [javadoc] javadoc: warning - getReferenceID: @return tag has no arguments.
  [javadoc] javadoc: warning - getReferenceID: @return tag has no arguments.
  [javadoc] javadoc: warning - getSession: @return tag has no arguments.
  [javadoc] javadoc: warning - getTextToSign: @return tag has no arguments.
  [javadoc] javadoc: warning - getTextToSign: @return tag has no arguments.
  [javadoc] javadoc: warning - getTextToSignForAuthentication: @return tag has no arguments.
  [javadoc] javadoc: warning - getTextToSignForAuthentication: @return tag has no arguments.
  [javadoc] javadoc: warning - handleInvocation: @return tag has no arguments.
  [javadoc] javadoc: warning - handleInvocation: @return tag has no arguments.
  [javadoc] javadoc: warning - handleInvocation: @return tag has no arguments.
  [javadoc] javadoc: warning - handleInvocation: @return tag has no arguments.
  [javadoc] javadoc: warning - handleInvocation: @return tag has no arguments.
  [javadoc] javadoc: warning - handleInvocation: @return tag has no arguments.
  [javadoc] javadoc: warning - handleInvocation: @return tag has no arguments.
  [javadoc] javadoc: warning - handleInvocation: @return tag has no arguments.
  [javadoc] javadoc: warning - handleInvocation: @return tag has no arguments.
  [javadoc] javadoc: warning - handleInvocation: @return tag has no arguments.
  [javadoc] javadoc: warning - handleInvocation: @return tag has no arguments.
  [javadoc] javadoc: warning - handleMethodInvocation: @return tag has no arguments.
  [javadoc] javadoc: warning - handleMethodInvocation: @return tag has no arguments.
  [javadoc] javadoc: warning - isBeanOnly: @return tag has no arguments.
  [javadoc] javadoc: warning - list: @return tag has no arguments.
  [javadoc] javadoc: warning - list: @return tag has no arguments.
  [javadoc] javadoc: warning - list: @return tag has no arguments.
  [javadoc] javadoc: warning - listBindings: @return tag has no arguments.
  [javadoc] javadoc: warning - listBindings: @return tag has no arguments.
  [javadoc] javadoc: warning - lookup: @return tag has no arguments.
  [javadoc] javadoc: warning - lookup: @return tag has no arguments.
  [javadoc] javadoc: warning - lookup: @return tag has no arguments.
  [javadoc] javadoc: warning - lookup: @return tag has no arguments.
  [javadoc] javadoc: warning - lookup: @return tag has no arguments.
  [javadoc] javadoc: warning - lookup: @return tag has no arguments.
  [javadoc] javadoc: warning - lookup: @return tag has no arguments.
  [javadoc] javadoc: warning - lookupLink: @return tag has no arguments.
  [javadoc] Building index for all classes...
  [javadoc] javadoc: warning - lookupLink: @return tag has no arguments.
  [javadoc] javadoc: warning - makeFacadeRefHolder: @return tag has no arguments.
  [javadoc] javadoc: warning - methodLogging: @return tag has no arguments.
  [javadoc] javadoc: warning - methodLogging: @return tag has no arguments.
  [javadoc] javadoc: warning - processObjectRequest: @return tag has no arguments.
  [javadoc] javadoc: warning - processObjectRequest: @return tag has no arguments.
  [javadoc] javadoc: warning - processObjectRequestGettingFacade: @return tag has no arguments.
  [javadoc] javadoc: warning - processObjectRequestGettingFacade: @return tag has no arguments.
  [javadoc] javadoc: warning - removeFromEnvironment: @return tag has no arguments.
  [javadoc] javadoc: warning - toString: @return tag has no arguments.
  [javadoc] javadoc: warning - tryReconnect: @return tag has no arguments.
  [javadoc] javadoc: warning - tryReconnect: @return tag has no arguments.
  [javadoc] Generating /home/rubys/jakarta/jakarta-avalon-excalibur/altrmi/dist/docs/api/stylesheet.css...
  [javadoc] 118 warnings

dist:
     [copy] Copying 1 file to /home/rubys/jakarta/jakarta-avalon-excalibur/altrmi/dist
    [mkdir] Created dir: /home/rubys/jakarta/jakarta-avalon-excalibur/altrmi/distributions
      [zip] Building zip: /home/rubys/jakarta/jakarta-avalon-excalibur/altrmi/distributions/excalibur-altrmi-0.6-bin.zip
   [delete] Deleting directory /home/rubys/jakarta/jakarta-avalon-excalibur/altrmi/dist

dependencies:

compile:

prepare-conf:

jar:
      [jar] Building jar: /home/rubys/jakarta/jakarta-avalon-excalibur/collections/build/lib/excalibur-collections-1.0.jar

dist-jar:
    [mkdir] Created dir: /home/rubys/jakarta/jakarta-avalon-excalibur/collections/dist
     [copy] Copying 2 files to /home/rubys/jakarta/jakarta-avalon-excalibur/collections/dist

dependencies-test:

compile-test:
    [mkdir] Created dir: /home/rubys/jakarta/jakarta-avalon-excalibur/collections/build/testsrc
     [copy] Copying 5 files to /home/rubys/jakarta/jakarta-avalon-excalibur/collections/build/testsrc
    [mkdir] Created dir: /home/rubys/jakarta/jakarta-avalon-excalibur/collections/build/testclasses
    [javac] Compiling 5 source files to /home/rubys/jakarta/jakarta-avalon-excalibur/collections/build/testclasses

test:
     [echo] Performing Unit Tests
    [mkdir] Created dir: /home/rubys/jakarta/jakarta-avalon-excalibur/collections/build/tests
    [junit] Running org.apache.avalon.excalibur.collections.test.BinaryHeapTestCase
    [junit] Tests run: 1, Failures: 0, Errors: 1, Time elapsed: 0 sec
    [junit] Testsuite: org.apache.avalon.excalibur.collections.test.BinaryHeapTestCase
    [junit] Tests run: 1, Failures: 0, Errors: 1, Time elapsed: 0 sec

    [junit] 	Caused an ERROR
    [junit] org.apache.avalon.excalibur.collections.test.BinaryHeapTestCase
    [junit] java.lang.ClassNotFoundException: org.apache.avalon.excalibur.collections.test.BinaryHeapTestCase
    [junit] 	at java.net.URLClassLoader$1.run(URLClassLoader.java:200)
    [junit] 	at java.security.AccessController.doPrivileged(Native Method)
    [junit] 	at java.net.URLClassLoader.findClass(URLClassLoader.java:188)
    [junit] 	at java.lang.ClassLoader.loadClass(ClassLoader.java:299)
    [junit] 	at sun.misc.Launcher$AppClassLoader.loadClass(Launcher.java:286)
    [junit] 	at java.lang.ClassLoader.loadClass(ClassLoader.java:255)
    [junit] 	at java.lang.ClassLoader.loadClassInternal(ClassLoader.java:315)
    [junit] 	at java.lang.Class.forName0(Native Method)
    [junit] 	at java.lang.Class.forName(Class.java:120)

    [junit] TEST org.apache.avalon.excalibur.collections.test.BinaryHeapTestCase FAILED
    [junit] Running org.apache.avalon.excalibur.collections.test.ThreadedMapTest
    [junit] Tests run: 1, Failures: 0, Errors: 1, Time elapsed: 0 sec
    [junit] Testsuite: org.apache.avalon.excalibur.collections.test.ThreadedMapTest
    [junit] Tests run: 1, Failures: 0, Errors: 1, Time elapsed: 0 sec

    [junit] 	Caused an ERROR
    [junit] org.apache.avalon.excalibur.collections.test.ThreadedMapTest
    [junit] java.lang.ClassNotFoundException: org.apache.avalon.excalibur.collections.test.ThreadedMapTest
    [junit] 	at java.net.URLClassLoader$1.run(URLClassLoader.java:200)
    [junit] 	at java.security.AccessController.doPrivileged(Native Method)
    [junit] 	at java.net.URLClassLoader.findClass(URLClassLoader.java:188)
    [junit] 	at java.lang.ClassLoader.loadClass(ClassLoader.java:299)
    [junit] 	at sun.misc.Launcher$AppClassLoader.loadClass(Launcher.java:286)
    [junit] 	at java.lang.ClassLoader.loadClass(ClassLoader.java:255)
    [junit] 	at java.lang.ClassLoader.loadClassInternal(ClassLoader.java:315)
    [junit] 	at java.lang.Class.forName0(Native Method)
    [junit] 	at java.lang.Class.forName(Class.java:120)

    [junit] TEST org.apache.avalon.excalibur.collections.test.ThreadedMapTest FAILED
    [junit] Running org.apache.avalon.excalibur.collections.test.VariableSizeBufferTestCase
    [junit] Tests run: 1, Failures: 0, Errors: 1, Time elapsed: 0 sec
    [junit] Testsuite: org.apache.avalon.excalibur.collections.test.VariableSizeBufferTestCase
    [junit] Tests run: 1, Failures: 0, Errors: 1, Time elapsed: 0 sec

    [junit] 	Caused an ERROR
    [junit] org.apache.avalon.excalibur.collections.test.VariableSizeBufferTestCase
    [junit] java.lang.ClassNotFoundException: org.apache.avalon.excalibur.collections.test.VariableSizeBufferTestCase
    [junit] 	at java.net.URLClassLoader$1.run(URLClassLoader.java:200)
    [junit] 	at java.security.AccessController.doPrivileged(Native Method)
    [junit] 	at java.net.URLClassLoader.findClass(URLClassLoader.java:188)
    [junit] 	at java.lang.ClassLoader.loadClass(ClassLoader.java:299)
    [junit] 	at sun.misc.Launcher$AppClassLoader.loadClass(Launcher.java:286)
    [junit] 	at java.lang.ClassLoader.loadClass(ClassLoader.java:255)
    [junit] 	at java.lang.ClassLoader.loadClassInternal(ClassLoader.java:315)
    [junit] 	at java.lang.Class.forName0(Native Method)
    [junit] 	at java.lang.Class.forName(Class.java:120)

    [junit] TEST org.apache.avalon.excalibur.collections.test.VariableSizeBufferTestCase FAILED
    [junit] Running org.apache.avalon.excalibur.collections.test.BucketMapTestCase
    [junit] Tests run: 1, Failures: 0, Errors: 1, Time elapsed: 0 sec
    [junit] Testsuite: org.apache.avalon.excalibur.collections.test.BucketMapTestCase
    [junit] Tests run: 1, Failures: 0, Errors: 1, Time elapsed: 0 sec

    [junit] 	Caused an ERROR
    [junit] org.apache.avalon.excalibur.collections.test.BucketMapTestCase
    [junit] java.lang.ClassNotFoundException: org.apache.avalon.excalibur.collections.test.BucketMapTestCase
    [junit] 	at java.net.URLClassLoader$1.run(URLClassLoader.java:200)
    [junit] 	at java.security.AccessController.doPrivileged(Native Method)
    [junit] 	at java.net.URLClassLoader.findClass(URLClassLoader.java:188)
    [junit] 	at java.lang.ClassLoader.loadClass(ClassLoader.java:299)
    [junit] 	at sun.misc.Launcher$AppClassLoader.loadClass(Launcher.java:286)
    [junit] 	at java.lang.ClassLoader.loadClass(ClassLoader.java:255)
    [junit] 	at java.lang.ClassLoader.loadClassInternal(ClassLoader.java:315)
    [junit] 	at java.lang.Class.forName0(Native Method)
    [junit] 	at java.lang.Class.forName(Class.java:120)

    [junit] TEST org.apache.avalon.excalibur.collections.test.BucketMapTestCase FAILED

test-reports:

checkBSF:

checkRequiredClass:

checkRequiredClass.fail:
    [mkdir] Created dir: /home/rubys/jakarta/jakarta-avalon-excalibur/collections/build/reports/junit
[junitreport] Using Xalan version: Xalan Java 2.4.D1
[junitreport] Transform time: 3025ms

checkstyle:

checkstyle-report:

javadocs:
    [mkdir] Created dir: /home/rubys/jakarta/jakarta-avalon-excalibur/collections/dist/docs/api
  [javadoc] Generating Javadoc
  [javadoc] Javadoc execution
  [javadoc] Loading source files for package org.apache.avalon.excalibur.collections...
  [javadoc] Constructing Javadoc information...
  [javadoc] Building tree for all the packages and classes...
  [javadoc] Building index for all the packages and classes...
  [javadoc] Building index for all classes...

dist:
     [copy] Copying 1 file to /home/rubys/jakarta/jakarta-avalon-excalibur/collections/dist
     [copy] Copying 1 file to /home/rubys/jakarta/jakarta-avalon-excalibur/collections/dist
      [zip] Building zip: /home/rubys/jakarta/jakarta-avalon-excalibur/collections/dist/src.zip
    [mkdir] Created dir: /home/rubys/jakarta/jakarta-avalon-excalibur/collections/distributions
      [zip] Building zip: /home/rubys/jakarta/jakarta-avalon-excalibur/collections/distributions/excalibur-collections-1.0.zip
   [delete] Deleting directory /home/rubys/jakarta/jakarta-avalon-excalibur/collections/dist

dependencies:

compile:

prepare-conf:

jar:
      [jar] Building jar: /home/rubys/jakarta/jakarta-avalon-excalibur/concurrent/build/lib/excalibur-concurrent-1.0.jar

dist-jar:
    [mkdir] Created dir: /home/rubys/jakarta/jakarta-avalon-excalibur/concurrent/dist
     [copy] Copying 2 files to /home/rubys/jakarta/jakarta-avalon-excalibur/concurrent/dist

dependencies-test:

compile-test:
    [mkdir] Created dir: /home/rubys/jakarta/jakarta-avalon-excalibur/concurrent/build/testsrc
     [copy] Copying 1 file to /home/rubys/jakarta/jakarta-avalon-excalibur/concurrent/build/testsrc
    [mkdir] Created dir: /home/rubys/jakarta/jakarta-avalon-excalibur/concurrent/build/testclasses
    [javac] Compiling 1 source file to /home/rubys/jakarta/jakarta-avalon-excalibur/concurrent/build/testclasses
    [javac] /home/rubys/jakarta/jakarta-avalon-excalibur/concurrent/build/testsrc/org/apache/avalon/excalibur/concurrent/test/ReadWriteLockTestCase.java:11:
cannot resolve symbol
    [javac] symbol  : class ReadWriteLock  
    [javac] location: package concurrent
    [javac] import org.apache.avalon.excalibur.concurrent.ReadWriteLock;
    [javac]                                               ^
    [javac] /home/rubys/jakarta/jakarta-avalon-excalibur/concurrent/build/testsrc/org/apache/avalon/excalibur/concurrent/test/ReadWriteLockTestCase.java:29:
cannot resolve symbol
    [javac] symbol  : class ReadWriteLock  
    [javac] location: class org.apache.avalon.excalibur.concurrent.test.ReadWriteLockTestCase.TriesWriteLock
    [javac]         protected ReadWriteLock m_lock;
    [javac]                   ^
    [javac] /home/rubys/jakarta/jakarta-avalon-excalibur/concurrent/build/testsrc/org/apache/avalon/excalibur/concurrent/test/ReadWriteLockTestCase.java:32:
cannot resolve symbol
    [javac] symbol  : class ReadWriteLock  
    [javac] location: class org.apache.avalon.excalibur.concurrent.test.ReadWriteLockTestCase.TriesWriteLock
    [javac]         public TriesWriteLock( ReadWriteLock lock )
    [javac]                                ^
    [javac] /home/rubys/jakarta/jakarta-avalon-excalibur/concurrent/build/testsrc/org/apache/avalon/excalibur/concurrent/test/ReadWriteLockTestCase.java:65:
cannot resolve symbol
    [javac] symbol  : class ReadWriteLock  
    [javac] location: class org.apache.avalon.excalibur.concurrent.test.ReadWriteLockTestCase.TriesReadLock
    [javac]         protected ReadWriteLock m_lock;
    [javac]                   ^
    [javac] /home/rubys/jakarta/jakarta-avalon-excalibur/concurrent/build/testsrc/org/apache/avalon/excalibur/concurrent/test/ReadWriteLockTestCase.java:68:
cannot resolve symbol
    [javac] symbol  : class ReadWriteLock  
    [javac] location: class org.apache.avalon.excalibur.concurrent.test.ReadWriteLockTestCase.TriesReadLock
    [javac]         public TriesReadLock( final ReadWriteLock lock )
    [javac]                                     ^
    [javac] /home/rubys/jakarta/jakarta-avalon-excalibur/concurrent/build/testsrc/org/apache/avalon/excalibur/concurrent/test/ReadWriteLockTestCase.java:105:
cannot resolve symbol
    [javac] symbol  : class ReadWriteLock  
    [javac] location: class org.apache.avalon.excalibur.concurrent.test.ReadWriteLockTestCase
    [javac]         final ReadWriteLock lock = new ReadWriteLock();
    [javac]               ^
    [javac] /home/rubys/jakarta/jakarta-avalon-excalibur/concurrent/build/testsrc/org/apache/avalon/excalibur/concurrent/test/ReadWriteLockTestCase.java:105:
cannot resolve symbol
    [javac] symbol  : class ReadWriteLock  
    [javac] location: class org.apache.avalon.excalibur.concurrent.test.ReadWriteLockTestCase
    [javac]         final ReadWriteLock lock = new ReadWriteLock();
    [javac]                                        ^
    [javac] /home/rubys/jakarta/jakarta-avalon-excalibur/concurrent/build/testsrc/org/apache/avalon/excalibur/concurrent/test/ReadWriteLockTestCase.java:142:
cannot resolve symbol
    [javac] symbol  : class ReadWriteLock  
    [javac] location: class org.apache.avalon.excalibur.concurrent.test.ReadWriteLockTestCase
    [javac]         ReadWriteLock lock = new ReadWriteLock();
    [javac]         ^
    [javac] /home/rubys/jakarta/jakarta-avalon-excalibur/concurrent/build/testsrc/org/apache/avalon/excalibur/concurrent/test/ReadWriteLockTestCase.java:142:
cannot resolve symbol
    [javac] symbol  : class ReadWriteLock  
    [javac] location: class org.apache.avalon.excalibur.concurrent.test.ReadWriteLockTestCase
    [javac]         ReadWriteLock lock = new ReadWriteLock();
    [javac]                                  ^
    [javac] /home/rubys/jakarta/jakarta-avalon-excalibur/concurrent/build/testsrc/org/apache/avalon/excalibur/concurrent/test/ReadWriteLockTestCase.java:161:
cannot resolve symbol
    [javac] symbol  : class ReadWriteLock  
    [javac] location: class org.apache.avalon.excalibur.concurrent.test.ReadWriteLockTestCase
    [javac]         ReadWriteLock lock = new ReadWriteLock();
    [javac]         ^
    [javac] /home/rubys/jakarta/jakarta-avalon-excalibur/concurrent/build/testsrc/org/apache/avalon/excalibur/concurrent/test/ReadWriteLockTestCase.java:161:
cannot resolve symbol
    [javac] symbol  : class ReadWriteLock  
    [javac] location: class org.apache.avalon.excalibur.concurrent.test.ReadWriteLockTestCase
    [javac]         ReadWriteLock lock = new ReadWriteLock();
    [javac]                                  ^
    [javac] /home/rubys/jakarta/jakarta-avalon-excalibur/concurrent/build/testsrc/org/apache/avalon/excalibur/concurrent/test/ReadWriteLockTestCase.java:241:
cannot resolve symbol
    [javac] symbol  : class ReadWriteLock  
    [javac] location: class org.apache.avalon.excalibur.concurrent.test.ReadWriteLockTestCase
    [javac]         ReadWriteLock lock = new ReadWriteLock();
    [javac]         ^
    [javac] /home/rubys/jakarta/jakarta-avalon-excalibur/concurrent/build/testsrc/org/apache/avalon/excalibur/concurrent/test/ReadWriteLockTestCase.java:241:
cannot resolve symbol
    [javac] symbol  : class ReadWriteLock  
    [javac] location: class org.apache.avalon.excalibur.concurrent.test.ReadWriteLockTestCase
    [javac]         ReadWriteLock lock = new ReadWriteLock();
    [javac]                                  ^
    [javac] /home/rubys/jakarta/jakarta-avalon-excalibur/concurrent/build/testsrc/org/apache/avalon/excalibur/concurrent/test/ReadWriteLockTestCase.java:272:
cannot resolve symbol
    [javac] symbol  : class ReadWriteLock  
    [javac] location: class org.apache.avalon.excalibur.concurrent.test.ReadWriteLockTestCase
    [javac]         ReadWriteLock lock = new ReadWriteLock();
    [javac]         ^
    [javac] /home/rubys/jakarta/jakarta-avalon-excalibur/concurrent/build/testsrc/org/apache/avalon/excalibur/concurrent/test/ReadWriteLockTestCase.java:272:
cannot resolve symbol
    [javac] symbol  : class ReadWriteLock  
    [javac] location: class org.apache.avalon.excalibur.concurrent.test.ReadWriteLockTestCase
    [javac]         ReadWriteLock lock = new ReadWriteLock();
    [javac]                                  ^
    [javac] /home/rubys/jakarta/jakarta-avalon-excalibur/concurrent/build/testsrc/org/apache/avalon/excalibur/concurrent/test/ReadWriteLockTestCase.java:324:
cannot resolve symbol
    [javac] symbol  : class ReadWriteLock  
    [javac] location: class org.apache.avalon.excalibur.concurrent.test.ReadWriteLockTestCase
    [javac]         ReadWriteLock lock = new ReadWriteLock();
    [javac]         ^
    [javac] /home/rubys/jakarta/jakarta-avalon-excalibur/concurrent/build/testsrc/org/apache/avalon/excalibur/concurrent/test/ReadWriteLockTestCase.java:324:
cannot resolve symbol
    [javac] symbol  : class ReadWriteLock  
    [javac] location: class org.apache.avalon.excalibur.concurrent.test.ReadWriteLockTestCase
    [javac]         ReadWriteLock lock = new ReadWriteLock();
    [javac]                                  ^
    [javac] 17 errors

BUILD FAILED
file:/home/rubys/jakarta/jakarta-avalon-excalibur/concurrent/build.xml:91: Compile failed;
see the compiler error output for details.

Total time: 1 minute 33 seconds

--
To unsubscribe, e-mail:   <mailto:avalon-dev-unsubscribe@jakarta.apache.org>
For additional commands, e-mail: <mailto:avalon-dev-help@jakarta.apache.org>


Mime
View raw message