avalon-dev mailing list archives

Site index · List index
Message view « Date » · « Thread »
Top « Date » · « Thread »
From Peter Donald <dona...@apache.org>
Subject [GUMP] Build Failure - Excalibur
Date Sat, 11 Aug 2001 10:08:49 GMT
----------------------------------------------------
This email is autogenerated from the output from:
<http://jakarta.apache.org/builds/gump/2001-08-11/jakarta-avalon-excalibur.html>
----------------------------------------------------

Buildfile: build.xml

check-environment:

check-datasource:

setup-properties:

jdbc2:

jdbc3:

prepare:

compile:
    [mkdir] Created dir: /home/rubys/jakarta/jakarta-avalon-excalibur/build/scratchpad
    [mkdir] Created dir: /home/rubys/jakarta/jakarta-avalon-excalibur/build/cadastre
    [javac] Compiling 91 source files to /home/rubys/jakarta/jakarta-avalon-excalibur/build/classes
    [javac] Note: /home/rubys/jakarta/jakarta-avalon-excalibur/src/test/org/apache/avalon/excalibur/datasource/test/DataSourceTestCase.java
uses or overrides a deprecated API.
    [javac] Note: Recompile with -deprecation for details.
    [javac] Compiling 43 source files to /home/rubys/jakarta/jakarta-avalon-excalibur/build/scratchpad
    [javac] Note: /home/rubys/jakarta/jakarta-avalon-excalibur/src/scratchpad/org/apache/avalon/excalibur/proxy/ProxyGenerator.java
uses or overrides a deprecated API.
    [javac] Note: Recompile with -deprecation for details.
    [javac] Compiling 20 source files to /home/rubys/jakarta/jakarta-avalon-excalibur/build/cadastre
     [rmic] RMI Compiling 1 class to /home/rubys/jakarta/jakarta-avalon-excalibur/build/cadastre
     [rmic] RMI Compiling 1 class to /home/rubys/jakarta/jakarta-avalon-excalibur/build/classes

jar:
      [jar] Building jar: /home/rubys/jakarta/jakarta-avalon-excalibur/build/lib/avalon-excalibur.jar
      [jar] Building jar: /home/rubys/jakarta/jakarta-avalon-excalibur/build/lib/avalon-scratchpad.jar
      [jar] Building jar: /home/rubys/jakarta/jakarta-avalon-excalibur/build/lib/avalon-cadastre.jar

javadocs:
    [mkdir] Created dir: /home/rubys/jakarta/jakarta-avalon-excalibur/build/javadocs
     [copy] Copying 88 files to /home/rubys/jakarta/jakarta-avalon-excalibur/build/src
  [javadoc] Generating Javadoc
  [javadoc] Javadoc execution
  [javadoc] Loading source files for package org.apache.avalon.excalibur.datasource...
  [javadoc] Loading source files for package org.apache.avalon.excalibur.naming...
  [javadoc] Loading source files for package org.apache.avalon.excalibur.naming.rmi...
  [javadoc] Loading source files for package org.apache.avalon.excalibur.naming.rmi.server...
  [javadoc] Loading source files for package org.apache.avalon.excalibur.naming.memory...
  [javadoc] Loading source files for package org.apache.avalon.excalibur.io...
  [javadoc] Loading source files for package org.apache.avalon.excalibur.collections...
  [javadoc] Loading source files for package org.apache.avalon.excalibur.cli...
  [javadoc] Loading source files for package org.apache.avalon.excalibur.pool...
  [javadoc] Loading source files for package org.apache.avalon.excalibur.component...
  [javadoc] Loading source files for package org.apache.avalon.excalibur.concurrent...
  [javadoc] Loading source files for package org.apache.avalon.excalibur.property...
  [javadoc] Constructing Javadoc information...
  [javadoc] javadoc: warning - Import not found: com.informix.jdbcx.IfxConnectionPoolDataSource
- ignoring!
  [javadoc] javadoc: warning - Import not found: com.informix.jdbcx.IfxDataSource - ignoring!
  [javadoc] Building tree for all the packages and classes...
  [javadoc] Building index for all the packages and classes...
  [javadoc] Building index for all classes...
  [javadoc] javadoc: warning - Tag @link: Class or Package not found: java.awt.FileDialog
  [javadoc] javadoc: warning - Tag @link: Class or Package not found: java.io.BufferedOuputStream
  [javadoc] Generating /home/rubys/jakarta/jakarta-avalon-excalibur/build/javadocs/stylesheet.css...
  [javadoc] 4 warnings
   [delete] Deleting directory /home/rubys/jakarta/jakarta-avalon-excalibur/build/src

test:
    [mkdir] Created dir: /home/rubys/jakarta/jakarta-avalon-excalibur/build/docs/test
    [mkdir] Created dir: /home/rubys/jakarta/jakarta-avalon-excalibur/build/reports
     [echo] Performing Unit Tests
    [junit] Running org.apache.avalon.excalibur.cli.test.ClutilTestCase
    [junit] Tests run: 11, Failures: 0, Errors: 0, Time elapsed: 1.389 sec
    [junit] Running org.apache.avalon.excalibur.collections.test.BinaryHeapTestCase
    [junit] Tests run: 10, Failures: 0, Errors: 0, Time elapsed: 1.323 sec
    [junit] Running org.apache.avalon.excalibur.datasource.test.DataSourceTestCase
    [junit] junit.framework.AssertionFailedError: Normal Use Test
    [junit] 	at junit.framework.Assert.fail(Assert.java:51)
    [junit] 	at junit.framework.Assert.assertTrue(Assert.java:38)
    [junit] 	at org.apache.avalon.excalibur.datasource.test.DataSourceTestCase.runDBTest(DataSourceTestCase.java:182)
    [junit] 	at org.apache.avalon.excalibur.datasource.test.DataSourceTestCase$ConnectionThread.run(DataSourceTestCase.java:206)
    [junit] 	at java.lang.Thread.run(Thread.java:484)
    [junit] junit.framework.AssertionFailedError: Normal Use Test
    [junit] 	at junit.framework.Assert.fail(Assert.java:51)
    [junit] 	at junit.framework.Assert.assertTrue(Assert.java:38)
    [junit] 	at org.apache.avalon.excalibur.datasource.test.DataSourceTestCase.runDBTest(DataSourceTestCase.java:182)
    [junit] 	at org.apache.avalon.excalibur.datasource.test.DataSourceTestCase$ConnectionThread.run(DataSourceTestCase.java:206)
    [junit] 	at java.lang.Thread.run(Thread.java:484)
    [junit] junit.framework.AssertionFailedError: Normal Use Test
    [junit] 	at junit.framework.Assert.fail(Assert.java:51)
    [junit] 	at junit.framework.Assert.assertTrue(Assert.java:38)
    [junit] 	at org.apache.avalon.excalibur.datasource.test.DataSourceTestCase.runDBTest(DataSourceTestCase.java:182)
    [junit] Tests run: 2, Failures: 0, Errors: 0, Time elapsed: 1.989 sec
    [junit] 	at org.apache.avalon.excalibur.datasource.test.DataSourceTestCase$ConnectionThread.run(DataSourceTestCase.java:206)
    [junit] 	at java.lang.Thread.run(Thread.java:484)
    [junit] junit.framework.AssertionFailedError: Normal Use Test
    [junit] 	at junit.framework.Assert.fail(Assert.java:51)
    [junit] 	at junit.framework.Assert.assertTrue(Assert.java:38)
    [junit] 	at org.apache.avalon.excalibur.datasource.test.DataSourceTestCase.runDBTest(DataSourceTestCase.java:182)
    [junit] 	at org.apache.avalon.excalibur.datasource.test.DataSourceTestCase$ConnectionThread.run(DataSourceTestCase.java:206)
    [junit] 	at java.lang.Thread.run(Thread.java:484)
    [junit] junit.framework.AssertionFailedError: Normal Use Test
    [junit] 	at junit.framework.Assert.fail(Assert.java:51)
    [junit] 	at junit.framework.Assert.assertTrue(Assert.java:38)
    [junit] 	at org.apache.avalon.excalibur.datasource.test.DataSourceTestCase.runDBTest(DataSourceTestCase.java:182)
    [junit] 	at org.apache.avalon.excalibur.datasource.test.DataSourceTestCase$ConnectionThread.run(DataSourceTestCase.java:206)
    [junit] 	at java.lang.Thread.run(Thread.java:484)
    [junit] junit.framework.AssertionFailedError: Normal Use Test
    [junit] 	at junit.framework.Assert.fail(Assert.java:51)
    [junit] 	at junit.framework.Assert.assertTrue(Assert.java:38)
    [junit] 	at org.apache.avalon.excalibur.datasource.test.DataSourceTestCase.runDBTest(DataSourceTestCase.java:182)
    [junit] 	at org.apache.avalon.excalibur.datasource.test.DataSourceTestCase$ConnectionThread.run(DataSourceTestCase.java:206)
    [junit] 	at java.lang.Thread.run(Thread.java:484)
    [junit] junit.framework.AssertionFailedError: Normal Use Test
    [junit] 	at junit.framework.Assert.fail(Assert.java:51)
    [junit] 	at junit.framework.Assert.assertTrue(Assert.java:38)
    [junit] 	at org.apache.avalon.excalibur.datasource.test.DataSourceTestCase.runDBTest(DataSourceTestCase.java:182)
    [junit] 	at org.apache.avalon.excalibur.datasource.test.DataSourceTestCase$ConnectionThread.run(DataSourceTestCase.java:206)
    [junit] 	at java.lang.Thread.run(Thread.java:484)
    [junit] junit.framework.AssertionFailedError: Normal Use Test
    [junit] 	at junit.framework.Assert.fail(Assert.java:51)
    [junit] 	at junit.framework.Assert.assertTrue(Assert.java:38)
    [junit] 	at org.apache.avalon.excalibur.datasource.test.DataSourceTestCase.runDBTest(DataSourceTestCase.java:182)
    [junit] 	at org.apache.avalon.excalibur.datasource.test.DataSourceTestCase$ConnectionThread.run(DataSourceTestCase.java:206)
    [junit] 	at java.lang.Thread.run(Thread.java:484)
    [junit] junit.framework.AssertionFailedError: Normal Use Test
    [junit] 	at junit.framework.Assert.fail(Assert.java:51)
    [junit] 	at junit.framework.Assert.assertTrue(Assert.java:38)
    [junit] 	at org.apache.avalon.excalibur.datasource.test.DataSourceTestCase.runDBTest(DataSourceTestCase.java:182)
    [junit] 	at org.apache.avalon.excalibur.datasource.test.DataSourceTestCase$ConnectionThread.run(DataSourceTestCase.java:206)
    [junit] 	at java.lang.Thread.run(Thread.java:484)
    [junit] junit.framework.AssertionFailedError: Normal Use Test
    [junit] 	at junit.framework.Assert.fail(Assert.java:51)
    [junit] 	at junit.framework.Assert.assertTrue(Assert.java:38)
    [junit] 	at org.apache.avalon.excalibur.datasource.test.DataSourceTestCase.runDBTest(DataSourceTestCase.java:182)
    [junit] 	at org.apache.avalon.excalibur.datasource.test.DataSourceTestCase$ConnectionThread.run(DataSourceTestCase.java:206)
    [junit] 	at java.lang.Thread.run(Thread.java:484)
    [junit] Running org.apache.avalon.excalibur.io.test.IOUtilTestCase
    [junit] Tests run: 13, Failures: 0, Errors: 0, Time elapsed: 1.601 sec
    [junit] Running org.apache.avalon.excalibur.io.test.FileUtilTestCase
    [junit] Tests run: 10, Failures: 0, Errors: 0, Time elapsed: 1.383 sec
    [junit] Running org.apache.avalon.excalibur.property.test.PropertyUtilTestCase
    [junit] Tests run: 8, Failures: 0, Errors: 0, Time elapsed: 1.367 sec
    [junit] Running org.apache.avalon.excalibur.concurrent.test.ReadWriteLockTestCase
    [junit] Tests run: 5, Failures: 0, Errors: 0, Time elapsed: 2.957 sec
    [junit] Running org.apache.avalon.excalibur.naming.memory.test.MemoryContextTestCase
    [junit] Tests run: 10, Failures: 0, Errors: 0, Time elapsed: 1.479 sec
    [junit] Running org.apache.avalon.excalibur.naming.rmi.test.RMIContextTestCase
    [junit] Starting server on port 1977
    [junit] Exporting RMI object on port 1099
    [junit] Accepted Connection
    [junit] Accepted Connection
    [junit] Accepted Connection
    [junit] Accepted Connection
    [junit] Accepted Connection
    [junit] Accepted Connection
    [junit] Accepted Connection
    [junit] Accepted Connection
    [junit] Accepted Connection
    [junit] Accepted Connection
    [junit] Stopping
    [junit] Unexporting object
    [junit] Server stopped
    [junit] Tests run: 10, Failures: 0, Errors: 0, Time elapsed: 4.123 sec
    [junit] Running org.apache.avalon.excalibur.i18n.test.XMLResourceBundleTestCase
    [junit] Tests run: 1, Failures: 0, Errors: 1, Time elapsed: 0 sec
    [junit] TEST org.apache.avalon.excalibur.i18n.test.XMLResourceBundleTestCase FAILED
    [junit] Running org.apache.avalon.excalibur.i18n.test.XMLResourceBundleFactoryTestCase
    [junit] Tests run: 1, Failures: 0, Errors: 1, Time elapsed: 0 sec
    [junit] TEST org.apache.avalon.excalibur.i18n.test.XMLResourceBundleFactoryTestCase FAILED
    [junit] Running org.apache.avalon.excalibur.proxy.test.ProxyGeneratorTestCase
    [junit] Tests run: 1, Failures: 0, Errors: 1, Time elapsed: 0 sec
    [junit] TEST org.apache.avalon.excalibur.proxy.test.ProxyGeneratorTestCase FAILED
    [junit] Running org.apache.avalon.excalibur.util.test.DependencyGraphTestCase
    [junit] Tests run: 1, Failures: 0, Errors: 1, Time elapsed: 0 sec
    [junit] TEST org.apache.avalon.excalibur.util.test.DependencyGraphTestCase FAILED
    [junit] Running org.apache.avalon.cadastre.rmi.test.RMIContextTestCase
    [junit] Tests run: 1, Failures: 0, Errors: 1, Time elapsed: 0 sec
    [junit] TEST org.apache.avalon.cadastre.rmi.test.RMIContextTestCase FAILED

BUILD FAILED

Could not create task of type: junitreport. Common solutions are to use taskdef to declare
your task, or, if this is an optional task, to put the optional.jar in the lib directory of
your ant installation (ANT_HOME).

Total time: 1 minute 34 seconds

---------------------------------------------------------------------
To unsubscribe, e-mail: avalon-dev-unsubscribe@jakarta.apache.org
For additional commands, e-mail: avalon-dev-help@jakarta.apache.org


Mime
View raw message