aurora-reviews mailing list archives

Site index · List index
Message view « Date » · « Thread »
Top « Date » · « Thread »
From Aurora ReviewBot <wfar...@apache.org>
Subject Re: Review Request 51298: A few executor fixes for filesystem isolation:
Date Thu, 25 Aug 2016 19:24:49 GMT

-----------------------------------------------------------
This is an automatically generated e-mail. To reply, visit:
https://reviews.apache.org/r/51298/#review146840
-----------------------------------------------------------



Master (50f47cc) is red with this patch.
  ./build-support/jenkins/build.sh

                           proxy_driver = ProxyDriver()
                           with temporary_dir() as checkpoint_root:
                             te = AuroraExecutor(
                     >           runner_provider=make_provider(checkpoint_root),
                                 sandbox_provider=DefaultTestSandboxProvider())
                     
                     src/test/python/apache/aurora/executor/test_thermos_executor.py:580:

                     _ _ _ _ _ _ _ _ _ _ _ _ _ _ _ _ _ _ _ _ _ _ _ _ _ 
                     src/test/python/apache/aurora/executor/test_thermos_executor.py:193:
in make_provider
                         pex_location=thermos_runner_path(),
                     _ _ _ _ _ _ _ _ _ _ _ _ _ _ _ _ _ _ _ _ _ _ _ _ _ 
                     
                     build = True
                     
                         def thermos_runner_path(build=True):
                           if not build:
                             return getattr(thermos_runner_path, 'value', None)
                         
                           if not hasattr(thermos_runner_path, 'value'):
                             pex_dir = safe_mkdtemp()
                     >       assert subprocess.call(["./pants", "--pants-distdir=%s"
% pex_dir, "binary",
                               "src/main/python/apache/thermos/runner:thermos_runner"])
== 0
                     E       assert 1 == 0
                     E        +  where 1 = <function call at 0x7fd7fd52e9b0>(['./pants',
'--pants-distdir=/tmp/tmpZ0VUPU', 'binary', 'src/main/python/apache/thermos/runner:thermos_runner'])
                     E        +    where <function call at 0x7fd7fd52e9b0>
= subprocess.call
                     
                     src/test/python/apache/aurora/executor/test_thermos_executor.py:185:
AssertionError
                     -------------- Captured stderr call --------------
                     Traceback (most recent call last):
                       File "/home/jenkins/jenkins-slave/workspace/AuroraBot/.home/.cache/pants/setup/bootstrap-Linux-x86_64/1.1.0-rc7/bin/pants",
line 7, in <module>
                         from pants.bin.pants_exe import main
                     ImportError: No module named pants.bin.pants_exe
                      generated xml file: /home/jenkins/jenkins-slave/workspace/AuroraBot/dist/test-results/415337499eb72578eab327a6487c1f5c9452b3d6.xml

                      17 failed, 671 passed, 6 skipped, 1 warnings, 8 error in 223.47
seconds 
                     
FAILURE


19:24:08 04:37   [complete]
               FAILURE


I will refresh this build result if you post a review containing "@ReviewBot retry"

- Aurora ReviewBot


On Aug. 25, 2016, 6:54 p.m., Joshua Cohen wrote:
> 
> -----------------------------------------------------------
> This is an automatically generated e-mail. To reply, visit:
> https://reviews.apache.org/r/51298/
> -----------------------------------------------------------
> 
> (Updated Aug. 25, 2016, 6:54 p.m.)
> 
> 
> Review request for Aurora and Maxim Khutornenko.
> 
> 
> Repository: aurora
> 
> 
> Description
> -------
> 
> - Add an option to skip the groupadd/useradd calls into the task's filesystem.
> - Mount any configured volumes into the task's filesystem.
> - Clean up http server script used by appc e2e tests.
> 
> 
> Diffs
> -----
> 
>   src/main/python/apache/aurora/executor/aurora_executor.py dde19a6914c7c7b2178220707f242f61f11f38bd

>   src/main/python/apache/aurora/executor/bin/thermos_executor_main.py 65a495d5c50d91b38c4328bab3bfec667f6a7ba9

>   src/main/python/apache/aurora/executor/common/sandbox.py 5f091af7636bd94f028f15d63437e305b02f741c

>   src/main/python/apache/aurora/executor/thermos_task_runner.py 1d713ca3d81a2e7be88b787dfcab328d887be24c

>   src/main/python/apache/thermos/core/process.py a296fa715ef6fbb8d5feae356914334437f353f1

>   src/main/python/apache/thermos/core/runner.py dcfc190f7ed529e4f816e02b2d969077c60b008f

>   src/main/python/apache/thermos/runner/thermos_runner.py 441bacdfe93b1805a03a1216762c74db810a9540

>   src/test/python/apache/aurora/executor/common/test_sandbox.py ce989b1ccda0f1bc7ba9e15dfe4be20116db3491

>   src/test/python/apache/aurora/executor/test_thermos_executor.py 06601df3bc355a690ff1789b2e2e34484fadefe9

>   src/test/python/apache/thermos/core/test_process.py 759f783202803c296ce19bb64c59cbe896d40a43

>   src/test/sh/org/apache/aurora/e2e/http/http_example.aurora b69ddf129c0015a878b089d85d731bc0c26fd55c

>   src/test/sh/org/apache/aurora/e2e/run-server.sh 76939888bed2e8138671d97f7bc56fd5641008e4

>   src/test/sh/org/apache/aurora/e2e/test_end_to_end.sh 0404d0e0a1a1054a5ed0c0b9f5f5be9fb3ecc113

> 
> Diff: https://reviews.apache.org/r/51298/diff/
> 
> 
> Testing
> -------
> 
> ./build-support/jenkins/build.sh
> e2e tests
> 
> 
> Thanks,
> 
> Joshua Cohen
> 
>


Mime
  • Unnamed multipart/alternative (inline, None, 0 bytes)
View raw message