aurora-reviews mailing list archives

Site index · List index
Message view « Date » · « Thread »
Top « Date » · « Thread »
From Aurora ReviewBot <wfar...@apache.org>
Subject Re: Review Request 49413: Fixup install docs to match 0.13.0+ packaging.
Date Thu, 30 Jun 2016 00:19:58 GMT

-----------------------------------------------------------
This is an automatically generated e-mail. To reply, visit:
https://reviews.apache.org/r/49413/#review140078
-----------------------------------------------------------



Master (6f93ae2) is red with this patch.
  ./build-support/jenkins/build.sh

1014 tests completed, 31 failed, 2 skipped
:test FAILED
:jacocoTestReport
Coverage report generated: file:///home/jenkins/jenkins-slave/workspace/AuroraBot/dist/reports/jacoco/test/html/index.html
:analyzeReport
Instruction coverage is 0.8706842152708916, but must be greater than 0.89
Branch coverage is 0.7772420443587271, but must be greater than 0.835
:analyzeReport FAILED

FAILURE: Build completed with 2 failures.

1: Task failed with an exception.
-----------
* What went wrong:
Execution failed for task ':test'.
> There were failing tests. See the report at: file:///home/jenkins/jenkins-slave/workspace/AuroraBot/dist/reports/tests/index.html

* Try:
Run with --stacktrace option to get the stack trace. Run with --info or --debug option to
get more log output.
==============================================================================

2: Task failed with an exception.
-----------
* What went wrong:
Execution failed for task ':analyzeReport'.
> Test coverage missing for org/apache/aurora/scheduler/http/LeaderRedirectFilter
  Test coverage missing for org/apache/aurora/scheduler/http/HttpStatsFilter
  Test coverage missing for org/apache/aurora/scheduler/http/HttpStatsFilter$1
  Test coverage missing for org/apache/aurora/scheduler/http/HttpStatsFilter$ResponseWithStatus
  Test coverage missing for org/apache/aurora/scheduler/http/api/security/ShiroKerberosAuthenticationFilter
  Test coverage missing for org/apache/aurora/scheduler/http/api/security/ShiroKerberosPermissiveAuthenticationFilter
  Test coverage missing for org/apache/aurora/scheduler/http/api/ApiBeta

* Try:
Run with --stacktrace option to get the stack trace. Run with --info or --debug option to
get more log output.
==============================================================================

BUILD FAILED

Total time: 6 mins 30.748 secs


I will refresh this build result if you post a review containing "@ReviewBot retry"

- Aurora ReviewBot


On June 30, 2016, 12:10 a.m., John Sirois wrote:
> 
> -----------------------------------------------------------
> This is an automatically generated e-mail. To reply, visit:
> https://reviews.apache.org/r/49413/
> -----------------------------------------------------------
> 
> (Updated June 30, 2016, 12:10 a.m.)
> 
> 
> Review request for Aurora and Stephan Erb.
> 
> 
> Repository: aurora
> 
> 
> Description
> -------
> 
> docs/operations/installation.md | 2 +-
>  1 file changed, 1 insertion(+), 1 deletion(-)
> 
> 
> Diffs
> -----
> 
>   docs/operations/installation.md d3fb529929aaf8975579930d50a59e155d1e4357 
> 
> Diff: https://reviews.apache.org/r/49413/diff/
> 
> 
> Testing
> -------
> 
> Came across the issue testing the 0.13.0 and 0.14.0 releases.
> 
> Rendered here:
>   https://github.com/jsirois/aurora/blob/jsirois/docs/installation/fix/docs/operations/installation.md#centos-7-2
> 
> 
> Thanks,
> 
> John Sirois
> 
>


Mime
  • Unnamed multipart/alternative (inline, None, 0 bytes)
View raw message