aurora-reviews mailing list archives

Site index · List index
Message view « Date » · « Thread »
Top « Date » · « Thread »
From Aurora ReviewBot <wfar...@apache.org>
Subject Re: Review Request 49384: Upgrade to Mesos 0.28.2.
Date Wed, 29 Jun 2016 17:21:23 GMT

-----------------------------------------------------------
This is an automatically generated e-mail. To reply, visit:
https://reviews.apache.org/r/49384/#review140018
-----------------------------------------------------------



Master (4e28b9c) is red with this patch.
  ./build-support/jenkins/build.sh

                           with temporary_dir() as checkpoint_root:
                             te = AuroraExecutor(
                     >           runner_provider=make_provider(checkpoint_root),
                                 sandbox_provider=DefaultTestSandboxProvider())
                     
                     src/test/python/apache/aurora/executor/test_thermos_executor.py:580:

                     _ _ _ _ _ _ _ _ _ _ _ _ _ _ _ _ _ _ _ _ _ _ _ _ _ 
                     src/test/python/apache/aurora/executor/test_thermos_executor.py:193:
in make_provider
                         pex_location=thermos_runner_path(),
                     _ _ _ _ _ _ _ _ _ _ _ _ _ _ _ _ _ _ _ _ _ _ _ _ _ 
                     
                     build = True
                     
                         def thermos_runner_path(build=True):
                           if not build:
                             return getattr(thermos_runner_path, 'value', None)
                         
                           if not hasattr(thermos_runner_path, 'value'):
                             pex_dir = safe_mkdtemp()
                     >       assert subprocess.call(["./pants", "--pants-distdir=%s"
% pex_dir, "binary",
                               "src/main/python/apache/thermos/runner:thermos_runner"])
== 0
                     E       assert 1 == 0
                     E        +  where 1 = <function call at 0x7f7295370938>(['./pants',
'--pants-distdir=/tmp/tmp4T5Wpj', 'binary', 'src/main/python/apache/thermos/runner:thermos_runner'])
                     E        +    where <function call at 0x7f7295370938>
= subprocess.call
                     
                     src/test/python/apache/aurora/executor/test_thermos_executor.py:185:
AssertionError
                     -------------- Captured stderr call --------------
                     Traceback (most recent call last):
                       File "/home/jenkins/.cache/pants/setup/bootstrap-Linux-x86_64/0.0.80/bin/pants",
line 7, in <module>
                         from pants.bin.pants_exe import main
                     ImportError: No module named pants.bin.pants_exe
                      generated xml file: /home/jenkins/jenkins-slave/workspace/AuroraBot/dist/test-results/415337499eb72578eab327a6487c1f5c9452b3d6.xml

                      16 failed, 638 passed, 6 skipped, 1 warnings, 8 error in 122.55
seconds 
                     
FAILURE


               Waiting for background workers to finish.
17:21:35 02:45   [complete]
               FAILURE


I will refresh this build result if you post a review containing "@ReviewBot retry"

- Aurora ReviewBot


On June 29, 2016, 4:33 p.m., Joshua Cohen wrote:
> 
> -----------------------------------------------------------
> This is an automatically generated e-mail. To reply, visit:
> https://reviews.apache.org/r/49384/
> -----------------------------------------------------------
> 
> (Updated June 29, 2016, 4:33 p.m.)
> 
> 
> Review request for Aurora and Maxim Khutornenko.
> 
> 
> Repository: aurora
> 
> 
> Description
> -------
> 
> Upgrade to Mesos 0.28.2.
> 
> Release notes: http://mesos.apache.org/blog/mesos-0-28-0-released/, http://mesos.apache.org/blog/mesos-0-28-2-released/
> 
> Upgrade instructions here: http://mesos.apache.org/documentation/latest/upgrades/. Maxim:
do we need to do anything about http://mesos.apache.org/documentation/latest/upgrades/#0-28-x-resource-precision?
> 
> 
> Diffs
> -----
> 
>   3rdparty/python/BUILD 85db569b43a4a121ed6c6b14688e19dd0278e145 
>   RELEASE-NOTES.md 5beda5dcb50ad1d6f50c3deb322587df58bc27d5 
>   Vagrantfile e7e113def27f241fa48a550885eff8faba52375a 
>   build-support/packer/build.sh 2a01d77a08959652a1607f1ade2bb8fbe7555762 
>   build.gradle 0d0d94a80613965282724dd82e61b2363d6a5361 
>   src/main/java/org/apache/aurora/scheduler/base/Conversions.java f2ff7abb51101c603df1bd1b21c4920a348743e1

> 
> Diff: https://reviews.apache.org/r/49384/diff/
> 
> 
> Testing
> -------
> 
> e2e
> ./gradlew build -Pq
> 
> 
> Thanks,
> 
> Joshua Cohen
> 
>


Mime
  • Unnamed multipart/alternative (inline, None, 0 bytes)
View raw message