aurora-reviews mailing list archives

Site index · List index
Message view « Date » · « Thread »
Top « Date » · « Thread »
From Aurora ReviewBot <wfar...@apache.org>
Subject Re: Review Request 48591: Ensure we can verify release candidates in the Vagrant box
Date Sun, 12 Jun 2016 18:47:18 GMT

-----------------------------------------------------------
This is an automatically generated e-mail. To reply, visit:
https://reviews.apache.org/r/48591/#review137192
-----------------------------------------------------------



Master (f9bbfb3) is red with this patch.
  ./build-support/jenkins/build.sh

Branch coverage is 0.750968992248062, but must be greater than 0.835
:analyzeReport FAILED

FAILURE: Build completed with 2 failures.

1: Task failed with an exception.
-----------
* What went wrong:
Execution failed for task ':test'.
> There were failing tests. See the report at: file:///home/jenkins/jenkins-slave/workspace/AuroraBot/dist/reports/tests/index.html

* Try:
Run with --stacktrace option to get the stack trace. Run with --info or --debug option to
get more log output.
==============================================================================

2: Task failed with an exception.
-----------
* What went wrong:
Execution failed for task ':analyzeReport'.
> Test coverage missing for org/apache/aurora/scheduler/storage/db/views/MigrationChangelogEntry
  Test coverage missing for org/apache/aurora/scheduler/http/Mname
  Test coverage missing for org/apache/aurora/scheduler/http/Maintenance
  Test coverage missing for org/apache/aurora/scheduler/spi/Permissions$UnscopedRpcPermission
  Test coverage missing for org/apache/aurora/GuiceUtils$2
  Test coverage missing for org/apache/aurora/scheduler/stats/AsyncStatsModule$SlotSizeCounterService
  Test coverage missing for org/apache/aurora/scheduler/stats/AsyncStatsModule$TaskStatUpdaterService
  Test coverage missing for org/apache/aurora/scheduler/reconciliation/TaskTimeout
  Test coverage missing for org/apache/aurora/scheduler/reconciliation/TaskTimeout$TimedOutTaskHandler
  Test coverage missing for org/apache/aurora/scheduler/storage/mem/MemTaskStore$SecondaryIndex$1
  Test coverage missing for org/apache/aurora/scheduler/preemptor/PreemptorModule$PreemptorService
  Test coverage missing for org/apache/aurora/scheduler/storage/log/LogStorage$ScheduledExecutorSchedulingService
  Test coverage missing for org/apache/aurora/scheduler/SchedulerLifecycle$DefaultDelayedActions

* Try:
Run with --stacktrace option to get the stack trace. Run with --info or --debug option to
get more log output.
==============================================================================

BUILD FAILED

Total time: 5 mins 47.351 secs


I will refresh this build result if you post a review containing "@ReviewBot retry"

- Aurora ReviewBot


On June 11, 2016, 10:21 p.m., Stephan Erb wrote:
> 
> -----------------------------------------------------------
> This is an automatically generated e-mail. To reply, visit:
> https://reviews.apache.org/r/48591/
> -----------------------------------------------------------
> 
> (Updated June 11, 2016, 10:21 p.m.)
> 
> 
> Review request for Aurora and Maxim Khutornenko.
> 
> 
> Repository: aurora
> 
> 
> Description
> -------
> 
> * bump the virtualbox memory to make the tests pass
>   (otherwise failing with 'Cannot allocate memory')
> * remove unnecessary destroy step that seems to be copy
>   pasted from the egg-building scripts.
> 
> 
> Diffs
> -----
> 
>   Vagrantfile b2b8f005bda89f2d5530fb2ccc0902b53bb0d9f7 
>   build-support/release/verify-release-candidate 7aa9c9095bbab1ad497186ec700fde2d52498ea7

> 
> Diff: https://reviews.apache.org/r/48591/diff/
> 
> 
> Testing
> -------
> 
> 
> Thanks,
> 
> Stephan Erb
> 
>


Mime
  • Unnamed multipart/alternative (inline, None, 0 bytes)
View raw message