aurora-reviews mailing list archives

Site index · List index
Message view « Date » · « Thread »
Top « Date » · « Thread »
From Aurora ReviewBot <wfar...@apache.org>
Subject Re: Review Request 47099: Fix dead link in documentation
Date Sun, 08 May 2016 21:51:33 GMT

-----------------------------------------------------------
This is an automatically generated e-mail. To reply, visit:
https://reviews.apache.org/r/47099/#review132189
-----------------------------------------------------------



Master (1eac7a6) is red with this patch.
  ./build-support/jenkins/build.sh

                           with temporary_dir() as checkpoint_root:
                             te = AuroraExecutor(
                     >           runner_provider=make_provider(checkpoint_root),
                                 sandbox_provider=DefaultTestSandboxProvider())
                     
                     src/test/python/apache/aurora/executor/test_thermos_executor.py:580:

                     _ _ _ _ _ _ _ _ _ _ _ _ _ _ _ _ _ _ _ _ _ _ _ _ _ 
                     src/test/python/apache/aurora/executor/test_thermos_executor.py:193:
in make_provider
                         pex_location=thermos_runner_path(),
                     _ _ _ _ _ _ _ _ _ _ _ _ _ _ _ _ _ _ _ _ _ _ _ _ _ 
                     
                     build = True
                     
                         def thermos_runner_path(build=True):
                           if not build:
                             return getattr(thermos_runner_path, 'value', None)
                         
                           if not hasattr(thermos_runner_path, 'value'):
                             pex_dir = safe_mkdtemp()
                     >       assert subprocess.call(["./pants", "--pants-distdir=%s"
% pex_dir, "binary",
                               "src/main/python/apache/thermos/runner:thermos_runner"])
== 0
                     E       assert 1 == 0
                     E        +  where 1 = <function call at 0x7f8f113dd938>(['./pants',
'--pants-distdir=/tmp/user/2395/tmpKGQzaF', 'binary', 'src/main/python/apache/thermos/runner:thermos_runner'])
                     E        +    where <function call at 0x7f8f113dd938>
= subprocess.call
                     
                     src/test/python/apache/aurora/executor/test_thermos_executor.py:185:
AssertionError
                     -------------- Captured stderr call --------------
                     Traceback (most recent call last):
                       File "/home/jenkins/.cache/pants/setup/bootstrap-Linux-x86_64/0.0.80/bin/pants",
line 7, in <module>
                         from pants.bin.pants_exe import main
                     ImportError: No module named pants.bin.pants_exe
                      generated xml file: /home/jenkins/jenkins-slave/workspace/AuroraBot/dist/test-results/415337499eb72578eab327a6487c1f5c9452b3d6.xml

                      16 failed, 625 passed, 6 skipped, 1 warnings, 8 error in 152.61
seconds 
                     
FAILURE


               Waiting for background workers to finish.
21:51:31 03:27   [complete]
               FAILURE


I will refresh this build result if you post a review containing "@ReviewBot retry"

- Aurora ReviewBot


On May 8, 2016, 9:33 p.m., Stephan Erb wrote:
> 
> -----------------------------------------------------------
> This is an automatically generated e-mail. To reply, visit:
> https://reviews.apache.org/r/47099/
> -----------------------------------------------------------
> 
> (Updated May 8, 2016, 9:33 p.m.)
> 
> 
> Review request for Aurora and John Sirois.
> 
> 
> Repository: aurora
> 
> 
> Description
> -------
> 
> Fix dead link in documentation
> 
> 
> Diffs
> -----
> 
>   docs/features/resource-isolation.md b9cdfebfd2c4635ee51c6fefdba3ceadb0c08212 
> 
> Diff: https://reviews.apache.org/r/47099/diff/
> 
> 
> Testing
> -------
> 
> 
> Thanks,
> 
> Stephan Erb
> 
>


Mime
  • Unnamed multipart/alternative (inline, None, 0 bytes)
View raw message