aurora-reviews mailing list archives

Site index · List index
Message view « Date » · « Thread »
Top « Date » · « Thread »
From Aurora ReviewBot <wfar...@apache.org>
Subject Re: Review Request 44680: Log exceptions raised when thermos running attempts to execute a process.
Date Thu, 10 Mar 2016 22:22:42 GMT

-----------------------------------------------------------
This is an automatically generated e-mail. To reply, visit:
https://reviews.apache.org/r/44680/#review123013
-----------------------------------------------------------



Master (72bf8db) is red with this patch.
  ./build-support/jenkins/build.sh

                           proxy_driver = ProxyDriver()
                           with temporary_dir() as checkpoint_root:
                             te = AuroraExecutor(
                     >           runner_provider=make_provider(checkpoint_root),
                                 sandbox_provider=DefaultTestSandboxProvider())
                     
                     src/test/python/apache/aurora/executor/test_thermos_executor.py:580:

                     _ _ _ _ _ _ _ _ _ _ _ _ _ _ _ _ _ _ _ _ _ _ _ _ _ 
                     src/test/python/apache/aurora/executor/test_thermos_executor.py:193:
in make_provider
                         pex_location=thermos_runner_path(),
                     _ _ _ _ _ _ _ _ _ _ _ _ _ _ _ _ _ _ _ _ _ _ _ _ _ 
                     
                     build = True
                     
                         def thermos_runner_path(build=True):
                           if not build:
                             return getattr(thermos_runner_path, 'value', None)
                         
                           if not hasattr(thermos_runner_path, 'value'):
                             pex_dir = safe_mkdtemp()
                     >       assert subprocess.call(["./pants", "--pants-distdir=%s"
% pex_dir, "binary",
                               "src/main/python/apache/thermos/runner:thermos_runner"])
== 0
                     E       assert 1 == 0
                     E        +  where 1 = <function call at 0x7f3cf0571b18>(['./pants',
'--pants-distdir=/tmp/user/10021/tmptabPnG', 'binary', 'src/main/python/apache/thermos/runner:thermos_runner'])
                     E        +    where <function call at 0x7f3cf0571b18>
= subprocess.call
                     
                     src/test/python/apache/aurora/executor/test_thermos_executor.py:185:
AssertionError
                     -------------- Captured stderr call --------------
                     Traceback (most recent call last):
                       File "/home/jenkins/.cache/pants/setup/bootstrap-Linux-x86_64/0.0.75/bin/pants",
line 7, in <module>
                         from pants.bin.pants_exe import main
                     ImportError: No module named pants.bin.pants_exe
                      generated xml file: /home/jenkins/jenkins-slave/workspace/AuroraBot/dist/test-results/415337499eb72578eab327a6487c1f5c9452b3d6.xml

                      16 failed, 638 passed, 5 skipped, 1 warnings, 8 error in 238.39
seconds 
                     
FAILURE


22:22:42 04:51   [complete]
               FAILURE


I will refresh this build result if you post a review containing "@ReviewBot retry"

- Aurora ReviewBot


On March 10, 2016, 9:59 p.m., Joshua Cohen wrote:
> 
> -----------------------------------------------------------
> This is an automatically generated e-mail. To reply, visit:
> https://reviews.apache.org/r/44680/
> -----------------------------------------------------------
> 
> (Updated March 10, 2016, 9:59 p.m.)
> 
> 
> Review request for Aurora and Zameer Manji.
> 
> 
> Repository: aurora
> 
> 
> Description
> -------
> 
> Log exceptions raised when thermos running attempts to execute a process.
> 
> 
> Diffs
> -----
> 
>   src/main/python/apache/thermos/core/process.py c343b2d1f3efc39ea8c445c93a9ac73a2bed3653

> 
> Diff: https://reviews.apache.org/r/44680/diff/
> 
> 
> Testing
> -------
> 
> ./pants test src/test/python/apache/thermos/core/
> 
> 
> Thanks,
> 
> Joshua Cohen
> 
>


Mime
  • Unnamed multipart/alternative (inline, None, 0 bytes)
View raw message