aurora-reviews mailing list archives

Site index · List index
Message view « Date » · « Thread »
Top « Date » · « Thread »
From "Aurora ReviewBot" <wfar...@apache.org>
Subject Re: Review Request 41717: Add jittering to TruncatedBinaryBackoff.
Date Sun, 03 Jan 2016 15:36:00 GMT

-----------------------------------------------------------
This is an automatically generated e-mail. To reply, visit:
https://reviews.apache.org/r/41717/#review112458
-----------------------------------------------------------


Master (4a9f2ff) is red with this patch.
  ./build-support/jenkins/build.sh

:buildSrc:check UP-TO-DATE
:buildSrc:build
:commons:assemble
:commons:licenseMain
Unknown file extension: commons/src/main/resources/org/apache/aurora/common/net/http/handlers/thrift.st
Unknown file extension: commons/src/main/resources/org/apache/aurora/common/net/http/handlers/logconfig.st
:commons:licenseMain UP-TO-DATE
:commons:licenseTest
Unknown file extension: commons/src/test/resources/org/apache/aurora/common/util/templating/template.st
:commons:licenseTest UP-TO-DATE
:commons:license UP-TO-DATE
:commons:compileTestJavaNote: Writing file:/home/jenkins/jenkins-slave/workspace/AuroraBot/commons/dist/classes/test/org/apache/aurora/common/args/apt/cmdline.arg.info.txt.2
Note: Writing file:/home/jenkins/jenkins-slave/workspace/AuroraBot/commons/dist/classes/test/META-INF/compiler/resource-mappings/org.apache.aurora.common.args.apt.CmdLineProcessor
Note: Some input files use or override a deprecated API.
Note: Recompile with -Xlint:deprecation for details.
Note: /home/jenkins/jenkins-slave/workspace/AuroraBot/commons/src/test/java/org/apache/aurora/common/collections/Iterables2Test.java
uses unchecked or unsafe operations.
Note: Recompile with -Xlint:unchecked for details.

:commons:processTestResources
:commons:testClasses
:commons:test

org.apache.aurora.common.util.TruncatedBinaryBackoffTest > testCalculateBackoffStop FAILED
    java.lang.AssertionError at TruncatedBinaryBackoffTest.java:96

197 tests completed, 1 failed
:commons:test FAILED

FAILURE: Build failed with an exception.

* What went wrong:
Execution failed for task ':commons:test'.
> There were failing tests. See the report at: file:///home/jenkins/jenkins-slave/workspace/AuroraBot/commons/dist/reports/tests/index.html

* Try:
Run with --stacktrace option to get the stack trace. Run with --info or --debug option to
get more log output.

BUILD FAILED

Total time: 4 mins 45.575 secs


I will refresh this build result if you post a review containing "@ReviewBot retry"

- Aurora ReviewBot


On Jan. 3, 2016, 3:24 p.m., Tony Dong wrote:
> 
> -----------------------------------------------------------
> This is an automatically generated e-mail. To reply, visit:
> https://reviews.apache.org/r/41717/
> -----------------------------------------------------------
> 
> (Updated Jan. 3, 2016, 3:24 p.m.)
> 
> 
> Review request for Aurora, Stephan Erb and Bill Farner.
> 
> 
> Repository: aurora
> 
> 
> Description
> -------
> 
> Add jittering to TruncatedBinaryBackoff.
> 
> 
> Diffs
> -----
> 
>   commons/src/main/java/org/apache/aurora/common/args/parsers/EnumParser.java 9f6a3ff977ef6a0e2d472a8e2cf90e7f9a63a985

>   commons/src/main/java/org/apache/aurora/common/util/TruncatedBinaryBackoff.java fd74b9f37c6cc24c7ea1cb239ba6354661d931e2

>   commons/src/test/java/org/apache/aurora/common/util/TruncatedBinaryBackoffTest.java
127a60331f8560d98733bd16654087f840abef72 
>   src/main/java/org/apache/aurora/scheduler/offers/OffersModule.java fbc589e9a7592cce6d92c4e987cde2e056406c3a

>   src/main/java/org/apache/aurora/scheduler/scheduling/RescheduleCalculator.java 291bf5f0baefef6dd10d19ec89e173ce495e6380

> 
> Diff: https://reviews.apache.org/r/41717/diff/
> 
> 
> Testing
> -------
> 
> 
> Thanks,
> 
> Tony Dong
> 
>


Mime
  • Unnamed multipart/alternative (inline, None, 0 bytes)
View raw message