aurora-reviews mailing list archives

Site index · List index
Message view « Date » · « Thread »
Top « Date » · « Thread »
From "Maxim Khutornenko" <ma...@apache.org>
Subject Re: Review Request 26985: Printing coverage report path on failed analysis.
Date Tue, 21 Oct 2014 21:33:46 GMT

-----------------------------------------------------------
This is an automatically generated e-mail. To reply, visit:
https://reviews.apache.org/r/26985/
-----------------------------------------------------------

(Updated Oct. 21, 2014, 9:33 p.m.)


Review request for Aurora, Joshua Cohen and Kevin Sweeney.


Changes
-------

-wfarner
+kevints


Repository: aurora


Description
-------

Failed coverage analysis blocks coverage report file message. Moving the `doLast` block into
`jacocoTestReport` task.


Diffs
-----

  build.gradle f4352d2ebf858930a6f219d96519e1cdc2bc14e5 

Diff: https://reviews.apache.org/r/26985/diff/


Testing
-------

BEFORE:
```
...
:jacocoTestReport UP-TO-DATE
:analyzeReport FAILED

FAILURE: Build failed with an exception.

* What went wrong:
Execution failed for task ':analyzeReport'.
> Instruction coverage of 0.88 exceeds min instruction coverage of 0.87, please raise the
threshold!

* Try:
Run with --stacktrace option to get the stack trace. Run with --info or --debug option to
get more log output.

BUILD FAILED
```

AFTER:
```
...
:jacocoTestReport
Coverage report generated: file:///Users/mkhutornenko/workspace3/aurora/dist/reports/jacoco/test/html/index.html
:analyzeReport FAILED

FAILURE: Build failed with an exception.

* What went wrong:
Execution failed for task ':analyzeReport'.
> Instruction coverage of 0.88 exceeds min instruction coverage of 0.87, please raise the
threshold!

* Try:
Run with --stacktrace option to get the stack trace. Run with --info or --debug option to
get more log output.

BUILD FAILED
```


Thanks,

Maxim Khutornenko


Mime
  • Unnamed multipart/alternative (inline, None, 0 bytes)
View raw message