aurora-issues mailing list archives

Site index · List index
Message view « Date » · « Thread »
Top « Date » · « Thread »
From "Chris Lambert (JIRA)" <j...@apache.org>
Subject [jira] [Updated] (AURORA-1054) src.test.python.apache.aurora.executor.thermos_task_runner appears to be flaky
Date Tue, 31 Mar 2015 03:53:54 GMT

     [ https://issues.apache.org/jira/browse/AURORA-1054?page=com.atlassian.jira.plugin.system.issuetabpanels:all-tabpanel
]

Chris Lambert updated AURORA-1054:
----------------------------------
    Sprint: Twitter Aurora Q1'15 Sprint 3, Twitter Aurora Q1'15 Sprint 4, Twitter Aurora Q1'15
Sprint 5, Twitter Aurora Q1'15 Sprint 6  (was: Twitter Aurora Q1'15 Sprint 3, Twitter Aurora
Q1'15 Sprint 4, Twitter Aurora Q1'15 Sprint 5)

> src.test.python.apache.aurora.executor.thermos_task_runner appears to be flaky
> ------------------------------------------------------------------------------
>
>                 Key: AURORA-1054
>                 URL: https://issues.apache.org/jira/browse/AURORA-1054
>             Project: Aurora
>          Issue Type: Story
>          Components: Executor
>            Reporter: Bill Farner
>            Assignee: brian wickman
>
> I've seen this test fail on a few reviews recently, but succeeds on a retry.
> {noformat}
>                      ==================== FAILURES ====================
>                       TestThermosTaskRunnerIntegration.test_integration_stop 
>                      
>                      self = <test_thermos_task_runner.TestThermosTaskRunnerIntegration
object at 0x7ff3e1dc6fd0>
>                      
>                          def test_integration_stop(self):
>                            with self.yield_sleepy(ThermosTaskRunner, sleep=1000,
exit_code=0) as task_runner:
>                              task_runner.start()
>                              task_runner.forked.wait()
>                          
>                              assert task_runner.status is None
>                          
>                              task_runner.stop()
>                          
>                      >       assert task_runner.status is not None
>                      E       assert None is not None
>                      E        +  where None = <apache.aurora.executor.thermos_task_runner.ThermosTaskRunner
object at 0x7ff3e3333490>.status
>                      
>                      src/test/python/apache/aurora/executor/test_thermos_task_runner.py:175:
AssertionError
>                      -------------- Captured stderr call --------------
>                      Writing log files to disk in /tmp/user/2396/tmpqHF5bz
>                      ERROR] Could not quitquitquit runner: Cannot take control of a task
in terminal state.
>                       generated xml file: /home/jenkins/jenkins-slave/workspace/AuroraBot/dist/test-results/src.test.python.apache.aurora.executor.thermos_task_runner.xml

>                      ====== 1 failed, 7 passed in 81.16 seconds =======
>                      src.test.python.apache.aurora.admin.admin                      
                .....   SUCCESS
>                      src.test.python.apache.aurora.admin.host_maintenance           
                .....   SUCCESS
>                      src.test.python.apache.aurora.admin.maintenance                
                .....   SUCCESS
>                      src.test.python.apache.aurora.client.api.api                   
                .....   SUCCESS
>                      src.test.python.apache.aurora.client.api.instance_watcher      
                .....   SUCCESS
>                      src.test.python.apache.aurora.client.api.job_monitor           
                .....   SUCCESS
>                      src.test.python.apache.aurora.client.api.mux                   
                .....   SUCCESS
>                      src.test.python.apache.aurora.client.api.quota_check           
                .....   SUCCESS
>                      src.test.python.apache.aurora.client.api.restarter             
                .....   SUCCESS
>                      src.test.python.apache.aurora.client.api.scheduler_client      
                .....   SUCCESS
>                      src.test.python.apache.aurora.client.api.sla                   
                .....   SUCCESS
>                      src.test.python.apache.aurora.client.api.task_util             
                .....   SUCCESS
>                      src.test.python.apache.aurora.client.api.updater               
                .....   SUCCESS
>                      src.test.python.apache.aurora.client.api.updater_util          
                .....   SUCCESS
>                      src.test.python.apache.aurora.client.base                      
                .....   SUCCESS
>                      src.test.python.apache.aurora.client.binding_helper            
                .....   SUCCESS
>                      src.test.python.apache.aurora.client.cli.api                   
                .....   SUCCESS
>                      src.test.python.apache.aurora.client.cli.client                
                .....   SUCCESS
>                      src.test.python.apache.aurora.client.cli.command_hooks         
                .....   SUCCESS
>                      src.test.python.apache.aurora.client.cli.config                
                .....   SUCCESS
>                      src.test.python.apache.aurora.client.cli.cron                  
                .....   SUCCESS
>                      src.test.python.apache.aurora.client.cli.inspect               
                .....   SUCCESS
>                      src.test.python.apache.aurora.client.cli.job                   
                .....   SUCCESS
>                      src.test.python.apache.aurora.client.cli.plugins               
                .....   SUCCESS
>                      src.test.python.apache.aurora.client.cli.quota                 
                .....   SUCCESS
>                      src.test.python.apache.aurora.client.cli.sla                   
                .....   SUCCESS
>                      src.test.python.apache.aurora.client.cli.supdate               
                .....   SUCCESS
>                      src.test.python.apache.aurora.client.cli.task                  
                .....   SUCCESS
>                      src.test.python.apache.aurora.client.cli.update                
                .....   SUCCESS
>                      src.test.python.apache.aurora.client.cli.version               
                .....   SUCCESS
>                      src.test.python.apache.aurora.client.config                    
                .....   SUCCESS
>                      src.test.python.apache.aurora.client.hooks.hooked_api          
                .....   SUCCESS
>                      src.test.python.apache.aurora.client.hooks.non_hooked_api      
                .....   SUCCESS
>                      src.test.python.apache.aurora.common.test_aurora_job_key       
                .....   SUCCESS
>                      src.test.python.apache.aurora.common.test_cluster              
                .....   SUCCESS
>                      src.test.python.apache.aurora.common.test_cluster_option       
                .....   SUCCESS
>                      src.test.python.apache.aurora.common.test_clusters             
                .....   SUCCESS
>                      src.test.python.apache.aurora.common.test_http_signaler        
                .....   SUCCESS
>                      src.test.python.apache.aurora.common.test_pex_version          
                .....   SUCCESS
>                      src.test.python.apache.aurora.common.test_shellify             
                .....   SUCCESS
>                      src.test.python.apache.aurora.common.test_transport            
                .....   SUCCESS
>                      src.test.python.apache.aurora.config.test_base                 
                .....   SUCCESS
>                      src.test.python.apache.aurora.config.test_constraint_parsing   
                .....   SUCCESS
>                      src.test.python.apache.aurora.config.test_loader               
                .....   SUCCESS
>                      src.test.python.apache.aurora.config.test_thrift               
                .....   SUCCESS
>                      src.test.python.apache.aurora.executor.common.task_info        
                .....   SUCCESS
>                      src.test.python.apache.aurora.executor.executor_base           
                .....   SUCCESS
>                      src.test.python.apache.aurora.executor.executor_detector       
                .....   SUCCESS
>                      src.test.python.apache.aurora.executor.executor_vars           
                .....   SUCCESS
>                      src.test.python.apache.aurora.executor.status_manager          
                .....   SUCCESS
>                      src.test.python.apache.aurora.executor.thermos_task_runner     
                .....   FAILURE
>                      src.test.python.apache.thermos.common.test_pathspec            
                .....   SUCCESS
>                      src.test.python.apache.thermos.core.test_runner_integration    
                .....   SUCCESS
>                      src.test.python.apache.thermos.monitoring.test_disk            
                .....   SUCCESS
>                      
> FAILURE
> 
> {noformat}



--
This message was sent by Atlassian JIRA
(v6.3.4#6332)

Mime
View raw message