aurora-dev mailing list archives

Site index · List index
Message view « Date » · « Thread »
Top « Date » · « Thread »
From Apache Jenkins Server <jenk...@builds.apache.org>
Subject Build failed in Jenkins: aurora-packaging-nightly #792
Date Tue, 10 Oct 2017 00:30:10 GMT
See <https://builds.apache.org/job/aurora-packaging-nightly/792/display/redirect>

------------------------------------------
Started by timer
[EnvInject] - Loading node environment variables.
Building remotely on qnode3 (ubuntu xenial) in workspace <https://builds.apache.org/job/aurora-packaging-nightly/ws/>
 > git rev-parse --is-inside-work-tree # timeout=10
Fetching changes from the remote Git repository
 > git config remote.origin.url https://git-wip-us.apache.org/repos/asf/aurora # timeout=10
Fetching upstream changes from https://git-wip-us.apache.org/repos/asf/aurora
 > git --version # timeout=10
 > git fetch --tags --progress https://git-wip-us.apache.org/repos/asf/aurora +refs/heads/*:refs/remotes/origin/*
--depth=1
 > git rev-parse refs/remotes/origin/master^{commit} # timeout=10
 > git rev-parse refs/remotes/origin/origin/master^{commit} # timeout=10
Checking out Revision 0169b81987604f9fe8fddd937da783d7cd2092f2 (refs/remotes/origin/master)
Commit message: "Run Jenkins tests without the Gradle daemon"
 > git config core.sparsecheckout # timeout=10
 > git checkout -f 0169b81987604f9fe8fddd937da783d7cd2092f2
 > git rev-list 0169b81987604f9fe8fddd937da783d7cd2092f2 # timeout=10
 > git rev-parse --is-inside-work-tree # timeout=10
Fetching changes from the remote Git repository
 > git config remote.origin.url https://git-wip-us.apache.org/repos/asf/aurora-packaging
# timeout=10
Fetching upstream changes from https://git-wip-us.apache.org/repos/asf/aurora-packaging
 > git --version # timeout=10
 > git fetch --tags --progress https://git-wip-us.apache.org/repos/asf/aurora-packaging
+refs/heads/*:refs/remotes/origin/*
 > git rev-parse refs/remotes/origin/master^{commit} # timeout=10
 > git rev-parse refs/remotes/origin/origin/master^{commit} # timeout=10
Checking out Revision de2ad96bde657962ef7512c260eac9e96d0edf00 (refs/remotes/origin/master)
Commit message: "Switch packaging release checksum to sha512"
 > git config core.sparsecheckout # timeout=10
 > git checkout -f de2ad96bde657962ef7512c260eac9e96d0edf00
 > git rev-list de2ad96bde657962ef7512c260eac9e96d0edf00 # timeout=10
FATAL: Unable to produce a script file
java.io.IOException: No space left on device
	at java.io.FileOutputStream.writeBytes(Native Method)
	at java.io.FileOutputStream.write(FileOutputStream.java:326)
	at sun.nio.cs.StreamEncoder.writeBytes(StreamEncoder.java:221)
	at sun.nio.cs.StreamEncoder.implClose(StreamEncoder.java:316)
	at sun.nio.cs.StreamEncoder.close(StreamEncoder.java:149)
	at java.io.OutputStreamWriter.close(OutputStreamWriter.java:233)
	at hudson.FilePath$17.invoke(FilePath.java:1381)
	at hudson.FilePath$17.invoke(FilePath.java:1364)
	at hudson.FilePath$FileCallableWrapper.call(FilePath.java:2750)
	at hudson.remoting.UserRequest.perform(UserRequest.java:181)
	at hudson.remoting.UserRequest.perform(UserRequest.java:52)
	at hudson.remoting.Request$2.run(Request.java:336)
	at hudson.remoting.InterceptingExecutorService$1.call(InterceptingExecutorService.java:68)
	at java.util.concurrent.FutureTask.run(FutureTask.java:266)
	at java.util.concurrent.ThreadPoolExecutor.runWorker(ThreadPoolExecutor.java:1142)
	at java.util.concurrent.ThreadPoolExecutor$Worker.run(ThreadPoolExecutor.java:617)
	at java.lang.Thread.run(Thread.java:745)
	at ......remote call to qnode3(Native Method)
	at hudson.remoting.Channel.attachCallSiteStackTrace(Channel.java:1554)
	at hudson.remoting.UserResponse.retrieve(UserRequest.java:281)
	at hudson.remoting.Channel.call(Channel.java:839)
	at hudson.FilePath.act(FilePath.java:987)
Caused: java.io.IOException: remote file operation failed: <https://builds.apache.org/job/aurora-packaging-nightly/ws/>
at hudson.remoting.Channel@2801ec2:qnode3
	at hudson.FilePath.act(FilePath.java:994)
	at hudson.FilePath.act(FilePath.java:976)
	at hudson.FilePath.createTextTempFile(FilePath.java:1364)
Caused: java.io.IOException: Failed to create a temp file on <https://builds.apache.org/job/aurora-packaging-nightly/ws/>
	at hudson.FilePath.createTextTempFile(FilePath.java:1387)
	at hudson.tasks.CommandInterpreter.createScriptFile(CommandInterpreter.java:162)
	at hudson.tasks.CommandInterpreter.perform(CommandInterpreter.java:94)
	at hudson.tasks.CommandInterpreter.perform(CommandInterpreter.java:66)
	at hudson.tasks.BuildStepMonitor$1.perform(BuildStepMonitor.java:20)
	at hudson.model.AbstractBuild$AbstractBuildExecution.perform(AbstractBuild.java:736)
	at hudson.model.Build$BuildExecution.build(Build.java:206)
	at hudson.model.Build$BuildExecution.doRun(Build.java:163)
	at hudson.model.AbstractBuild$AbstractBuildExecution.run(AbstractBuild.java:496)
	at hudson.model.Run.execute(Run.java:1737)
	at hudson.model.FreeStyleBuild.run(FreeStyleBuild.java:43)
	at hudson.model.ResourceController.execute(ResourceController.java:97)
	at hudson.model.Executor.run(Executor.java:419)
Build step 'Execute shell' marked build as failure
Skipped archiving because build is not successful

Mime
View raw message