aurora-dev mailing list archives

Site index · List index
Message view « Date » · « Thread »
Top « Date » · « Thread »
From Apache Jenkins Server <jenk...@builds.apache.org>
Subject Build failed in Jenkins: aurora-packaging-nightly #770
Date Sun, 03 Sep 2017 00:39:54 GMT
See <https://builds.apache.org/job/aurora-packaging-nightly/770/display/redirect>

------------------------------------------
[...truncated 1.81 MB...]
index.js
license
package.json
readme.md

artifacts/aurora-centos-7/dist/rpmbuild/BUILD/apache-aurora-0.19.0-SNAPSHOT/ui/node_modules/yargs/node_modules/path-type:
index.js
license
package.json
readme.md

artifacts/aurora-centos-7/dist/rpmbuild/BUILD/apache-aurora-0.19.0-SNAPSHOT/ui/node_modules/yargs/node_modules/read-pkg:
index.js
license
package.json
readme.md

artifacts/aurora-centos-7/dist/rpmbuild/BUILD/apache-aurora-0.19.0-SNAPSHOT/ui/node_modules/yargs/node_modules/read-pkg-up:
index.js
license
package.json
readme.md

artifacts/aurora-centos-7/dist/rpmbuild/BUILD/apache-aurora-0.19.0-SNAPSHOT/ui/node_modules/yargs/node_modules/string-width:
index.js
license
package.json
readme.md

artifacts/aurora-centos-7/dist/rpmbuild/BUILD/apache-aurora-0.19.0-SNAPSHOT/ui/node_modules/yargs/node_modules/strip-bom:
index.js
license
package.json
readme.md

artifacts/aurora-centos-7/dist/rpmbuild/BUILD/apache-aurora-0.19.0-SNAPSHOT/ui/node_modules/yargs-parser:
CHANGELOG.md
index.js
lib
LICENSE.txt
node_modules
package.json
README.md

artifacts/aurora-centos-7/dist/rpmbuild/BUILD/apache-aurora-0.19.0-SNAPSHOT/ui/node_modules/yargs-parser/lib:
tokenize-arg-string.js

artifacts/aurora-centos-7/dist/rpmbuild/BUILD/apache-aurora-0.19.0-SNAPSHOT/ui/node_modules/yargs-parser/node_modules:
camelcase

artifacts/aurora-centos-7/dist/rpmbuild/BUILD/apache-aurora-0.19.0-SNAPSHOT/ui/node_modules/yargs-parser/node_modules/camelcase:
index.js
license
package.json
readme.md

artifacts/aurora-centos-7/dist/rpmbuild/BUILD/apache-aurora-0.19.0-SNAPSHOT/ui/node_modules/yauzl:
index.js
LICENSE
package.json
README.md

artifacts/aurora-centos-7/dist/rpmbuild/BUILD/apache-aurora-0.19.0-SNAPSHOT/ui/node_modules/yeast:
index.js
LICENSE
package.json
README.md

artifacts/aurora-centos-7/dist/rpmbuild/BUILD/apache-aurora-0.19.0-SNAPSHOT/ui/src:
main

artifacts/aurora-centos-7/dist/rpmbuild/BUILD/apache-aurora-0.19.0-SNAPSHOT/ui/src/main:
js

artifacts/aurora-centos-7/dist/rpmbuild/BUILD/apache-aurora-0.19.0-SNAPSHOT/ui/src/main/js:
components
index.js

artifacts/aurora-centos-7/dist/rpmbuild/BUILD/apache-aurora-0.19.0-SNAPSHOT/ui/src/main/js/components:
Home.js
__tests__

artifacts/aurora-centos-7/dist/rpmbuild/BUILD/apache-aurora-0.19.0-SNAPSHOT/ui/src/main/js/components/__tests__:
Home-test.js

artifacts/aurora-centos-7/dist/rpmbuild/BUILDROOT:

artifacts/aurora-centos-7/dist/rpmbuild/RPMS:
x86_64

artifacts/aurora-centos-7/dist/rpmbuild/RPMS/x86_64:
aurora-executor-0.19.0_SNAPSHOT.2017.08.31-1.el7.centos.aurora.x86_64.rpm
aurora-executor-0.19.0_SNAPSHOT.2017.09.03-1.el7.centos.aurora.x86_64.rpm
aurora-scheduler-0.19.0_SNAPSHOT.2017.08.31-1.el7.centos.aurora.x86_64.rpm
aurora-scheduler-0.19.0_SNAPSHOT.2017.09.03-1.el7.centos.aurora.x86_64.rpm
aurora-scheduler-debuginfo-0.19.0_SNAPSHOT.2017.08.31-1.el7.centos.aurora.x86_64.rpm
aurora-scheduler-debuginfo-0.19.0_SNAPSHOT.2017.09.03-1.el7.centos.aurora.x86_64.rpm
aurora-tools-0.19.0_SNAPSHOT.2017.08.31-1.el7.centos.aurora.x86_64.rpm
aurora-tools-0.19.0_SNAPSHOT.2017.09.03-1.el7.centos.aurora.x86_64.rpm
repodata

artifacts/aurora-centos-7/dist/rpmbuild/RPMS/x86_64/repodata:
05d2d5957ee6ab2e92c6e932d17b246cd276e02308600ef7fa7a5406c3a07bf6-filelists.xml.gz
1dce5d7a1beab96076e3a6558dcd74525bce85f90ac71c41e48ce0628a405a26-other.sqlite.bz2
303e298748b806c092a5fba09f8f45a4480b74a020fe624d124cdde9a2c825b9-filelists.sqlite.bz2
363a032f3a184f980ea4c9166bb3731d4cc1d728a587da682f92c0f00647cc5d-other.xml.gz
3d20afc1fa711b9a57e793e4d235743ed67b577e796ed4dd19c6cee2243cb3e4-other.sqlite.bz2
3d82827a556316166bc33c9ba1fce39ebf79bf85e5c3a351502a70cfa45153ce-primary.sqlite.bz2
40b78c1225c0d433fbc7dc6a0e5b4c87ef0d7419c44d6d6274ad9cd1717ddc6b-other.xml.gz
7b5ae3261f0eddc4646ef706cdfb3bbff9c54079db18ec67f320d4d488e22890-primary.sqlite.bz2
9fc85c6acc920a035592e6a27130ecba9a5872d5d6c49fa6c87f72c4246feebb-filelists.sqlite.bz2
d0be4f3067039f532c5e9cf665ae153443d3c9f229ebdfa5b42ac8dc856dd35b-filelists.xml.gz
d2c6e6584501320b7deb5630e2fa34a7be6578ce78f286a44fcdc19ce3f05083-primary.xml.gz
e4c855d13f4094b10d249ae092ab35c77b791b6ccc80d143c24cb25614e2d4b5-primary.xml.gz
repomd.xml

artifacts/aurora-centos-7/dist/rpmbuild/SOURCES:
apache-aurora-0.19.0_SNAPSHOT.2017.08.31.tar.gz
apache-aurora-0.19.0_SNAPSHOT.2017.09.03.tar.gz
aurora-pants.ini
aurora-scheduler.init.sh
aurora-scheduler.logrotate
aurora-scheduler.service
aurora-scheduler.startup.sh
aurora-scheduler.sysconfig
clusters.json
thermos.init.sh
thermos.logrotate
thermos.service
thermos.startup.sh
thermos.sysconfig

artifacts/aurora-centos-7/dist/rpmbuild/SRPMS:
aurora-scheduler-0.19.0_SNAPSHOT.2017.08.31-1.el7.centos.aurora.src.rpm
aurora-scheduler-0.19.0_SNAPSHOT.2017.09.03-1.el7.centos.aurora.src.rpm
builder/rpm/centos-7
Using docker image aurora-ubuntu-trusty
Sending build context to Docker daemon 5.632 kB
Step 1/9 : FROM ubuntu:trusty
trusty: Pulling from library/ubuntu
Digest: sha256:6a3e01207b899a347115f3859cf8a6031fdbebb6ffedea6c2097be40a298c85d
Status: Image is up to date for ubuntu:trusty
 ---> c69811d4e993
Step 2/9 : WORKDIR /aurora
 ---> Using cache
 ---> 9f2d4dfa56a8
Step 3/9 : ENV HOME /aurora
 ---> Using cache
 ---> e86c788cd5b3
Step 4/9 : ENV DEBIAN_FRONTEND noninteractive
 ---> Using cache
 ---> 00a89677e5c1
Step 5/9 : RUN apt-get update && apt-get -y install   bison   debhelper   dh-systemd
  devscripts   dpkg-dev   curl   git   libapr1-dev   libcurl4-openssl-dev   libffi-dev   libsvn-dev
  python-all-dev   software-properties-common
 ---> Using cache
 ---> 8ebe187c1652
Step 6/9 : RUN add-apt-repository -y ppa:openjdk-r/ppa   && apt-get update   &&
apt-get -y install openjdk-8-jdk   && update-alternatives --set java /usr/lib/jvm/java-8-openjdk-amd64/jre/bin/java
 ---> Using cache
 ---> 52999dadd069
Step 7/9 : RUN curl -sSL http://apache.org/dist/thrift/KEYS | gpg --import - &&  
 gpg --export --armor 66B778F9 | sudo apt-key add - &&    echo 'deb http://www.apache.org/dist/thrift/debian
0.9.1 main' > /etc/apt/sources.list.d/thrift.list &&    apt-get update &&
   apt-get -y install thrift-compiler=0.9.1
 ---> Using cache
 ---> b8b7a5131707
Step 8/9 : RUN git clone --depth 1 https://github.com/benley/gradle-packaging   &&
cd gradle-packaging   && apt-get -y install ruby ruby-dev unzip wget   &&
gem install fpm && ./gradle-mkdeb.sh 3.1   && apt-get -y install gdebi-core
  && gdebi --non-interactive gradle-3.1_3.1-2_all.deb   && cd .. &&
rm -rf gradle-packaging
 ---> Using cache
 ---> f8e1c5699fcb
Step 9/9 : ADD build.sh /build.sh
 ---> Using cache
 ---> 4352756aeb92
Successfully built 4352756aeb92
+ mkdir /scratch
+ cd /scratch
+ tar --strip-components 1 -C . -xf /src.tar.gz
+ cp -R /specs/debian .
++ lsb_release -is
++ tr '[:upper:]' '[:lower:]'
+ DISTRO=ubuntu
++ lsb_release -cs
++ tr '[:upper:]' '[:lower:]'
+ CODENAME=trusty
+ THIRD_PARTY_REPO=https://svn.apache.org/repos/asf/aurora/3rdparty/
+ THIRD_PARTY_REPO+=ubuntu/trusty64/python/
+ echo '[python-repos]'
+ echo 'repos: ['\''third_party/'\'', '\''https://svn.apache.org/repos/asf/aurora/3rdparty/ubuntu/trusty64/python/'\'']'
+ export 'DEBFULLNAME=Apache Aurora'
+ DEBFULLNAME='Apache Aurora'
+ export DEBEMAIL=dev@aurora.apache.org
+ DEBEMAIL=dev@aurora.apache.org
++ date -R
+ dch --newversion 0.19.0-SNAPSHOT.2017.09.03 --package apache-aurora --urgency medium 'Apache
Aurora package builder <dev@aurora.apache.org> Sun, 03 Sep 2017 00:39:12 +0000'
dch warning: Previous package version was Debian native whilst new version is not
+ dch --release ''
+ dpkg-buildpackage -uc -b -tc
dpkg-buildpackage: source package apache-aurora
dpkg-buildpackage: source version 0.19.0-SNAPSHOT.2017.09.03
dpkg-buildpackage: source distribution trusty
dpkg-buildpackage: source changed by Apache Aurora <dev@aurora.apache.org>
dpkg-buildpackage: host architecture amd64
 dpkg-source --before-build scratch
 debian/rules clean
dh clean --exclude=aurora-scheduler.bat --with=systemd
   dh_testdir -O--exclude=aurora-scheduler.bat
   dh_auto_clean -O--exclude=aurora-scheduler.bat
   dh_clean -O--exclude=aurora-scheduler.bat
 debian/rules build
dh build --exclude=aurora-scheduler.bat --with=systemd
   dh_testdir -O--exclude=aurora-scheduler.bat
   dh_auto_configure -O--exclude=aurora-scheduler.bat
   debian/rules override_dh_auto_build
make[1]: Entering directory `/scratch'
/usr/bin/gradle installDist
Starting a Gradle Daemon (subsequent builds will be faster)
> Starting Daemon> Starting Daemon > Connecting to Daemon> LoadingInvalidating
buildSrc state cache (/scratch/buildSrc/.gradle/noVersion/buildSrc) as it was not closed cleanly.
> Loading > buildSrc > settings> Loading > buildSrc> Loading > buildSrc
> Compiling jar:file:/opt/gradle-3.1/lib/gradle-core-3.1.jar!/org/gradle/initialization/buildsrc/defaultBuildSourceScript.txt
into local build cache> Loading > buildSrc > Compiling jar:file:/opt/gradle-3.1/lib/gradle-core-3.1.jar!/org/gradle/initialization/buildsrc/defaultBuildSourceScript.txt
into local build cache > Compiling script 'jar:file:/opt/gradle-3.1/lib/gradle-core-3.1.jar!/org/gradle/initialization/buildsrc/defaultBuildSourceScript.txt'
to cross build script cache> Loading > buildSrc > Compiling jar:file:/opt/gradle-3.1/lib/gradle-core-3.1.jar!/org/gradle/initialization/buildsrc/defaultBuildSourceScript.txt
into local build cache> Loading > buildSrc > Compiling jar:file:/opt/gradle-3.1/lib/gradle-core-3.1.jar!/org/gradle/initialization/buildsrc/defaultBuildSourceScript.txt
into local build cache > Compiling script 'jar:file:/opt/gradle-3.1/lib/gradle-core-3.1.jar!/org/gradle/initialization/buildsrc/defaultBuildSourceScript.txt'
to cross build script cache> Loading > buildSrc > Compiling jar:file:/opt/gradle-3.1/lib/gradle-core-3.1.jar!/org/gradle/initialization/buildsrc/defaultBuildSourceScript.txt
into local build cache> Loading > buildSrcGenerating JAR file 'gradle-api-3.1.jar'
> Loading > buildSrc> Loading > buildSrc > Generating 0%> Loading > buildSrc
> Generating 1%> Loading > buildSrc > Generating 2%> Loading > buildSrc
> Generating 3%> Loading > buildSrc > Generating 4%> Loading > buildSrc
> Generating 9%> Loading > buildSrc > Generating 10%> Loading > buildSrc
> Generating 20%> Loading > buildSrc > Generating 25%> Loading > buildSrc
> Generating 26%> Loading > buildSrc > Generating 27%> Loading > buildSrc
> Generating 29%> Loading > buildSrc > Generating 33%> Loading > buildSrc
> Generating 38%> Loading > buildSrc > Generating 41%> Loading > buildSrc
> Generating 44%> Loading > buildSrc > Generating 47%> Loading > buildSrc
> Generating 48%> Loading > buildSrc > Generating 49%> Loading > buildSrc
> Generating 50%> Loading > buildSrc > Generating 51%> Loading > buildSrc
> Generating 52%> Loading > buildSrc > Generating 56%> Loading > buildSrc
> Generating 58%> Loading > buildSrc > Generating 62%> Loading > buildSrc
> Generating 63%> Loading > buildSrc > Generating 64%> Loading > buildSrc
> Generating 67%> Loading > buildSrc > Generating 69%> Loading > buildSrc
> Generating 70%> Loading > buildSrc > Generating 74%> Loading > buildSrc
> Generating 76%> Loading > buildSrc > Generating 77%> Loading > buildSrc
> Generating 78%> Loading > buildSrc > Generating 82%> Loading > buildSrc
> Generating 84%> Loading > buildSrc > Generating 85%> Loading > buildSrc
> Generating 86%> Loading > buildSrc > Generating 87%> Loading > buildSrc
> Generating 88%> Loading > buildSrc > Generating 89%> Loading > buildSrc
> Generating 92%> Loading > buildSrc > Generating 94%> Loading > buildSrc
> Generating 100%                                        
> Loading > buildSrc> Loading > buildSrc > Compiling /scratch/buildSrc/build.gradle
into local build cache> Loading > buildSrc > Compiling /scratch/buildSrc/build.gradle
into local build cache > Compiling build file '/scratch/buildSrc/build.gradle' to cross
build script cache> Loading > buildSrc > Compiling /scratch/buildSrc/build.gradle
into local build cache> Loading > buildSrc > Resolving dependencies ':runtime'>
Loading > buildSrc:buildSrc:clean UP-TO-DATE
:buildSrc:compileJava UP-TO-DATE
> Loading > buildSrc > :buildSrc:compileGroovy:buildSrc:compileGroovy
> Loading > buildSrc:buildSrc:processResources UP-TO-DATE
:buildSrc:classes
> Loading > buildSrc > :buildSrc:jar:buildSrc:jar
:buildSrc:assemble
:buildSrc:compileTestJava UP-TO-DATE
:buildSrc:compileTestGroovy UP-TO-DATE
:buildSrc:processTestResources UP-TO-DATE
:buildSrc:testClasses UP-TO-DATE
:buildSrc:test UP-TO-DATE
:buildSrc:check UP-TO-DATE
:buildSrc:build
> Loading > settings> Configuring > 0/6 projects > root project > Compiling
/scratch/build.gradle into local build cache > Compiling build file '/scratch/build.gradle'
to cross build script cache> Configuring > 0/6 projects > root project > Compiling
/scratch/build.gradle into local build cache> Configuring > 0/6 projects > root project>
Configuring > 0/6 projects
FAILURE: Build failed with an exception.

* Where:
Build file '/scratch/build.gradle' line: 18

* What went wrong:
Error resolving plugin [id: 'com.eriwen.gradle.js', version: '1.12.1']
> org.apache.http.ssl.SSLInitializationException: /usr/lib/jvm/java-8-openjdk-amd64/jre/lib/security/cacerts
(No such file or directory)

* Try:
Run with --stacktrace option to get the stack trace. Run with --info or --debug option to
get more log output.

BUILD FAILED

Total time: 35.166 secs
make[1]: *** [__gradle_build] Error 1
make[1]: Leaving directory `/scratch'
make: *** [build] Error 2
dpkg-buildpackage: error: debian/rules build gave error exit status 2
Build step 'Execute shell' marked build as failure
Skipped archiving because build is not successful

Mime
View raw message