aurora-dev mailing list archives

Site index · List index
Message view « Date » · « Thread »
Top « Date » · « Thread »
From Apache Jenkins Server <jenk...@builds.apache.org>
Subject Build failed in Jenkins: aurora-packaging-nightly #742
Date Wed, 02 Aug 2017 00:38:25 GMT
See <https://builds.apache.org/job/aurora-packaging-nightly/742/display/redirect>

------------------------------------------
[...truncated 322.55 KB...]
               Waiting for background workers to finish.
00:36:08 00:08   [complete]
               SUCCESS
/scratch/pants binary src/main/python/apache/aurora/tools:thermos
fatal: Not a git repository (or any of the parent directories): .git

00:36:10 00:00 [main]
               (To run a reporting server: ./pants server)
00:36:10 00:00   [setup]
00:36:10 00:00     [parse]fatal: Not a git repository (or any of the parent directories):
.git

               Executing tasks in goals: binary
00:36:10 00:00   [binary]
00:36:10 00:00     [binary-prep-command]
00:36:10 00:00       [prep_command]
00:36:15 00:05     [python-binary-create]
00:36:15 00:05       [cache] 
                   No cached artifacts for 1 target.
                   Invalidated 1 target.
00:36:15 00:05       [chroot]
                   created pex dist/thermos.pex
               Waiting for background workers to finish.
00:36:25 00:15   [complete]
               SUCCESS
/scratch/pants binary src/main/python/apache/aurora/tools:thermos_observer
fatal: Not a git repository (or any of the parent directories): .git

00:36:27 00:00 [main]
               (To run a reporting server: ./pants server)
00:36:27 00:00   [setup]
00:36:27 00:00     [parse]fatal: Not a git repository (or any of the parent directories):
.git

               Executing tasks in goals: binary
00:36:27 00:00   [binary]
00:36:27 00:00     [binary-prep-command]
00:36:27 00:00       [prep_command]
00:36:32 00:05     [python-binary-create]
00:36:32 00:05       [cache] 
                   No cached artifacts for 1 target.
                   Invalidated 1 target.
00:36:32 00:05       [chroot]
                   created pex dist/thermos_observer.pex
               Waiting for background workers to finish.
00:36:36 00:09   [complete]
               SUCCESS
/scratch/pants binary src/main/python/apache/thermos/runner:thermos_runner
fatal: Not a git repository (or any of the parent directories): .git

00:36:38 00:00 [main]
               (To run a reporting server: ./pants server)
00:36:38 00:00   [setup]
00:36:38 00:00     [parse]fatal: Not a git repository (or any of the parent directories):
.git

               Executing tasks in goals: binary
00:36:38 00:00   [binary]
00:36:38 00:00     [binary-prep-command]
00:36:38 00:00       [prep_command]
00:36:43 00:05     [python-binary-create]
00:36:43 00:05       [cache] 
                   No cached artifacts for 1 target.
                   Invalidated 1 target.
00:36:43 00:05       [chroot]
                   created pex dist/thermos_runner.pex
               Waiting for background workers to finish.
00:36:45 00:07   [complete]
               SUCCESS
build-support/embed_runner_in_executor.py
dh override_dh_auto_build --exclude=aurora-scheduler.bat --with=systemd
make[1]: Leaving directory '/scratch'
   dh_auto_test -O--exclude=aurora-scheduler.bat
 debian/rules binary
dh binary --exclude=aurora-scheduler.bat --with=systemd
   dh_testroot -O--exclude=aurora-scheduler.bat
   dh_prep -O--exclude=aurora-scheduler.bat
   dh_installdirs -O--exclude=aurora-scheduler.bat
   debian/rules override_dh_auto_install
make[1]: Entering directory '/scratch'
dh_auto_install
# Install start up script for aurora-scheduler
install -D -m 0755 /scratch/debian/aurora-scheduler.startup.sh /scratch/debian/aurora-scheduler/usr/bin/aurora-scheduler-startup
make[1]: Leaving directory '/scratch'
   dh_install -O--exclude=aurora-scheduler.bat
   dh_installdocs -O--exclude=aurora-scheduler.bat
   dh_installchangelogs -O--exclude=aurora-scheduler.bat
   dh_installexamples -O--exclude=aurora-scheduler.bat
   dh_systemd_enable -O--exclude=aurora-scheduler.bat
   debian/rules override_dh_installinit
make[1]: Entering directory '/scratch'
dh_installinit --name=thermos
dh_installinit
make[1]: Leaving directory '/scratch'
   dh_systemd_start -O--exclude=aurora-scheduler.bat
   dh_perl -O--exclude=aurora-scheduler.bat
   dh_link -O--exclude=aurora-scheduler.bat
   dh_compress -O--exclude=aurora-scheduler.bat
   dh_fixperms -O--exclude=aurora-scheduler.bat
   dh_strip -O--exclude=aurora-scheduler.bat
   dh_makeshlibs -O--exclude=aurora-scheduler.bat
   dh_shlibdeps -O--exclude=aurora-scheduler.bat
   dh_installdeb -O--exclude=aurora-scheduler.bat
   dh_gencontrol -O--exclude=aurora-scheduler.bat
dpkg-gencontrol: warning: Depends field of package aurora-scheduler: unknown substitution
variable ${shlibs:Depends}
dpkg-gencontrol: warning: Depends field of package aurora-tools: unknown substitution variable
${shlibs:Depends}
dpkg-gencontrol: warning: Depends field of package aurora-executor: unknown substitution variable
${shlibs:Depends}
   dh_md5sums -O--exclude=aurora-scheduler.bat
   dh_builddeb -O--exclude=aurora-scheduler.bat
dpkg-deb: building package `aurora-scheduler' in `../aurora-scheduler_0.19.0-SNAPSHOT.2017.08.02_amd64.deb'.
dpkg-deb: building package `aurora-tools' in `../aurora-tools_0.19.0-SNAPSHOT.2017.08.02_amd64.deb'.
dpkg-deb: building package `aurora-executor' in `../aurora-executor_0.19.0-SNAPSHOT.2017.08.02_amd64.deb'.
dpkg-deb: building package `aurora-doc' in `../aurora-doc_0.19.0-SNAPSHOT.2017.08.02_all.deb'.
 dpkg-genchanges -b >../apache-aurora_0.19.0-SNAPSHOT.2017.08.02_amd64.changes
dpkg-genchanges: binary-only upload (no source code included)
 debian/rules clean
dh clean --exclude=aurora-scheduler.bat --with=systemd
   dh_testdir -O--exclude=aurora-scheduler.bat
   dh_auto_clean -O--exclude=aurora-scheduler.bat
   dh_clean -O--exclude=aurora-scheduler.bat
 dpkg-source --after-build scratch
dpkg-buildpackage: binary-only upload (no source included)
+ mkdir /dist
+ mv ../aurora-doc_0.19.0-SNAPSHOT.2017.08.02_all.deb ../aurora-executor_0.19.0-SNAPSHOT.2017.08.02_amd64.deb
../aurora-scheduler_0.19.0-SNAPSHOT.2017.08.02_amd64.deb ../aurora-tools_0.19.0-SNAPSHOT.2017.08.02_amd64.deb
/dist
bbf225380aeb
Produced artifacts in artifacts/aurora-debian-jessie:
artifacts/aurora-debian-jessie:
dist

artifacts/aurora-debian-jessie/dist:
aurora-doc_0.19.0-SNAPSHOT.2017.07.31_all.deb
aurora-doc_0.19.0-SNAPSHOT.2017.08.02_all.deb
aurora-executor_0.19.0-SNAPSHOT.2017.07.31_amd64.deb
aurora-executor_0.19.0-SNAPSHOT.2017.08.02_amd64.deb
aurora-scheduler_0.19.0-SNAPSHOT.2017.07.31_amd64.deb
aurora-scheduler_0.19.0-SNAPSHOT.2017.08.02_amd64.deb
aurora-tools_0.19.0-SNAPSHOT.2017.07.31_amd64.deb
aurora-tools_0.19.0-SNAPSHOT.2017.08.02_amd64.deb
builder/deb/debian-jessie
Using docker image aurora-ubuntu-trusty
Sending build context to Docker daemon 5.632 kB
Step 1/9 : FROM ubuntu:trusty
trusty: Pulling from library/ubuntu
Digest: sha256:13eecbc0e57928c1cb3ccca3581e2a6f4b0f39c1acf5a279e740e478accd119b
Status: Image is up to date for ubuntu:trusty
 ---> 54333f1de4ed
Step 2/9 : WORKDIR /aurora
 ---> Using cache
 ---> 839b6bc94bc8
Step 3/9 : ENV HOME /aurora
 ---> Using cache
 ---> 4d7a7cc41305
Step 4/9 : ENV DEBIAN_FRONTEND noninteractive
 ---> Using cache
 ---> 8d9385ed91ae
Step 5/9 : RUN apt-get update && apt-get -y install   bison   debhelper   dh-systemd
  devscripts   dpkg-dev   curl   git   libapr1-dev   libcurl4-openssl-dev   libffi-dev   libsvn-dev
  python-all-dev   software-properties-common
 ---> Using cache
 ---> f32e4dd52565
Step 6/9 : RUN add-apt-repository -y ppa:openjdk-r/ppa   && apt-get update   &&
apt-get -y install openjdk-8-jdk   && update-alternatives --set java /usr/lib/jvm/java-8-openjdk-amd64/jre/bin/java
 ---> Using cache
 ---> b49f99cd9a55
Step 7/9 : RUN curl -sSL http://apache.org/dist/thrift/KEYS | gpg --import - &&  
 gpg --export --armor 66B778F9 | sudo apt-key add - &&    echo 'deb http://www.apache.org/dist/thrift/debian
0.9.1 main' > /etc/apt/sources.list.d/thrift.list &&    apt-get update &&
   apt-get -y install thrift-compiler=0.9.1
 ---> Using cache
 ---> 918dbdfd82cd
Step 8/9 : RUN git clone --depth 1 https://github.com/benley/gradle-packaging   &&
cd gradle-packaging   && apt-get -y install ruby ruby-dev unzip wget   &&
gem install fpm && ./gradle-mkdeb.sh 3.1   && apt-get -y install gdebi-core
  && gdebi --non-interactive gradle-3.1_3.1-2_all.deb   && cd .. &&
rm -rf gradle-packaging
 ---> Using cache
 ---> d341e8a1ce12
Step 9/9 : ADD build.sh /build.sh
 ---> Using cache
 ---> c852a6791a86
Successfully built c852a6791a86
+ mkdir /scratch
+ cd /scratch
+ tar --strip-components 1 -C . -xf /src.tar.gz
+ cp -R /specs/debian .
++ lsb_release -is
++ tr '[:upper:]' '[:lower:]'
+ DISTRO=ubuntu
++ lsb_release -cs
++ tr '[:upper:]' '[:lower:]'
+ CODENAME=trusty
+ THIRD_PARTY_REPO=https://svn.apache.org/repos/asf/aurora/3rdparty/
+ THIRD_PARTY_REPO+=ubuntu/trusty64/python/
+ echo '[python-repos]'
+ echo 'repos: ['\''third_party/'\'', '\''https://svn.apache.org/repos/asf/aurora/3rdparty/ubuntu/trusty64/python/'\'']'
+ export 'DEBFULLNAME=Apache Aurora'
+ DEBFULLNAME='Apache Aurora'
+ export DEBEMAIL=dev@aurora.apache.org
+ DEBEMAIL=dev@aurora.apache.org
++ date -R
+ dch --newversion 0.19.0-SNAPSHOT.2017.08.02 --package apache-aurora --urgency medium 'Apache
Aurora package builder <dev@aurora.apache.org> Wed, 02 Aug 2017 00:37:47 +0000'
dch warning: Previous package version was Debian native whilst new version is not
+ dch --release ''
+ dpkg-buildpackage -uc -b -tc
dpkg-buildpackage: source package apache-aurora
dpkg-buildpackage: source version 0.19.0-SNAPSHOT.2017.08.02
dpkg-buildpackage: source distribution trusty
dpkg-buildpackage: source changed by Apache Aurora <dev@aurora.apache.org>
dpkg-buildpackage: host architecture amd64
 dpkg-source --before-build scratch
 debian/rules clean
dh clean --exclude=aurora-scheduler.bat --with=systemd
   dh_testdir -O--exclude=aurora-scheduler.bat
   dh_auto_clean -O--exclude=aurora-scheduler.bat
   dh_clean -O--exclude=aurora-scheduler.bat
 debian/rules build
dh build --exclude=aurora-scheduler.bat --with=systemd
   dh_testdir -O--exclude=aurora-scheduler.bat
   dh_auto_configure -O--exclude=aurora-scheduler.bat
   debian/rules override_dh_auto_build
make[1]: Entering directory `/scratch'
/usr/bin/gradle installDist
Starting a Gradle Daemon (subsequent builds will be faster)
> Starting Daemon> Starting Daemon > Connecting to Daemon> LoadingInvalidating
buildSrc state cache (/scratch/buildSrc/.gradle/noVersion/buildSrc) as it was not closed cleanly.
> Loading > buildSrc > settings> Loading > buildSrc> Loading > buildSrc
> Compiling jar:file:/opt/gradle-3.1/lib/gradle-core-3.1.jar!/org/gradle/initialization/buildsrc/defaultBuildSourceScript.txt
into local build cache> Loading > buildSrc > Compiling jar:file:/opt/gradle-3.1/lib/gradle-core-3.1.jar!/org/gradle/initialization/buildsrc/defaultBuildSourceScript.txt
into local build cache > Compiling script 'jar:file:/opt/gradle-3.1/lib/gradle-core-3.1.jar!/org/gradle/initialization/buildsrc/defaultBuildSourceScript.txt'
to cross build script cache> Loading > buildSrc > Compiling jar:file:/opt/gradle-3.1/lib/gradle-core-3.1.jar!/org/gradle/initialization/buildsrc/defaultBuildSourceScript.txt
into local build cache> Loading > buildSrc > Compiling jar:file:/opt/gradle-3.1/lib/gradle-core-3.1.jar!/org/gradle/initialization/buildsrc/defaultBuildSourceScript.txt
into local build cache > Compiling script 'jar:file:/opt/gradle-3.1/lib/gradle-core-3.1.jar!/org/gradle/initialization/buildsrc/defaultBuildSourceScript.txt'
to cross build script cache> Loading > buildSrc > Compiling jar:file:/opt/gradle-3.1/lib/gradle-core-3.1.jar!/org/gradle/initialization/buildsrc/defaultBuildSourceScript.txt
into local build cache> Loading > buildSrcGenerating JAR file 'gradle-api-3.1.jar'
> Loading > buildSrc> Loading > buildSrc > Generating 0%> Loading > buildSrc
> Generating 1%> Loading > buildSrc > Generating 2%> Loading > buildSrc
> Generating 3%> Loading > buildSrc > Generating 4%> Loading > buildSrc
> Generating 8%> Loading > buildSrc > Generating 9%> Loading > buildSrc
> Generating 10%> Loading > buildSrc > Generating 13%> Loading > buildSrc
> Generating 19%> Loading > buildSrc > Generating 20%> Loading > buildSrc
> Generating 25%> Loading > buildSrc > Generating 26%> Loading > buildSrc
> Generating 27%> Loading > buildSrc > Generating 28%> Loading > buildSrc
> Generating 29%> Loading > buildSrc > Generating 30%> Loading > buildSrc
> Generating 31%> Loading > buildSrc > Generating 35%> Loading > buildSrc
> Generating 36%> Loading > buildSrc > Generating 38%> Loading > buildSrc
> Generating 40%> Loading > buildSrc > Generating 42%> Loading > buildSrc
> Generating 45%> Loading > buildSrc > Generating 47%> Loading > buildSrc
> Generating 48%> Loading > buildSrc > Generating 49%> Loading > buildSrc
> Generating 50%> Loading > buildSrc > Generating 51%> Loading > buildSrc
> Generating 52%> Loading > buildSrc > Generating 54%> Loading > buildSrc
> Generating 56%> Loading > buildSrc > Generating 58%> Loading > buildSrc
> Generating 61%> Loading > buildSrc > Generating 62%> Loading > buildSrc
> Generating 63%> Loading > buildSrc > Generating 64%> Loading > buildSrc
> Generating 65%> Loading > buildSrc > Generating 67%> Loading > buildSrc
> Generating 69%> Loading > buildSrc > Generating 70%> Loading > buildSrc
> Generating 72%> Loading > buildSrc > Generating 75%> Loading > buildSrc
> Generating 76%> Loading > buildSrc > Generating 77%> Loading > buildSrc
> Generating 78%> Loading > buildSrc > Generating 80%> Loading > buildSrc
> Generating 84%> Loading > buildSrc > Generating 85%> Loading > buildSrc
> Generating 86%> Loading > buildSrc > Generating 87%> Loading > buildSrc
> Generating 88%> Loading > buildSrc > Generating 89%> Loading > buildSrc
> Generating 90%> Loading > buildSrc > Generating 92%> Loading > buildSrc
> Generating 93%> Loading > buildSrc > Generating 94%> Loading > buildSrc
> Generating 95%> Loading > buildSrc > Generating 96%> Loading > buildSrc
> Generating 100%                                        
> Loading > buildSrc> Loading > buildSrc > Compiling /scratch/buildSrc/build.gradle
into local build cache> Loading > buildSrc > Compiling /scratch/buildSrc/build.gradle
into local build cache > Compiling build file '/scratch/buildSrc/build.gradle' to cross
build script cache> Loading > buildSrc > Compiling /scratch/buildSrc/build.gradle
into local build cache> Loading > buildSrc> Loading > buildSrc > Resolving
dependencies ':runtime'> Loading > buildSrc> Loading > buildSrc > :buildSrc:clean:buildSrc:clean
UP-TO-DATE
:buildSrc:compileJava UP-TO-DATE
> Loading > buildSrc > :buildSrc:compileGroovy:buildSrc:compileGroovy
> Loading > buildSrc:buildSrc:processResources UP-TO-DATE
:buildSrc:classes
> Loading > buildSrc > :buildSrc:jar:buildSrc:jar
:buildSrc:assemble
:buildSrc:compileTestJava UP-TO-DATE
:buildSrc:compileTestGroovy UP-TO-DATE
:buildSrc:processTestResources UP-TO-DATE
:buildSrc:testClasses UP-TO-DATE
:buildSrc:test UP-TO-DATE
:buildSrc:check UP-TO-DATE
:buildSrc:build
> Loading > buildSrc> Loading > settings> Configuring > 0/5 projects >
root project > Compiling /scratch/build.gradle into local build cache > Compiling build
file '/scratch/build.gradle' to cross build script cache> Configuring > 0/5 projects
> root project > Compiling /scratch/build.gradle into local build cache> Configuring
> 0/5 projects > root project> Configuring > 0/5 projects
FAILURE: Build failed with an exception.

* Where:
Build file '/scratch/build.gradle' line: 18

* What went wrong:
Error resolving plugin [id: 'com.eriwen.gradle.js', version: '1.12.1']
> org.apache.http.ssl.SSLInitializationException: /usr/lib/jvm/java-8-openjdk-amd64/jre/lib/security/cacerts
(No such file or directory)

* Try:
Run with --stacktrace option to get the stack trace. Run with --info or --debug option to
get more log output.

BUILD FAILED

Total time: 33.402 secs
make[1]: *** [__gradle_build] Error 1
make[1]: Leaving directory `/scratch'
make: *** [build] Error 2
dpkg-buildpackage: error: debian/rules build gave error exit status 2
Build step 'Execute shell' marked build as failure
Skipped archiving because build is not successful

Mime
View raw message