aurora-dev mailing list archives

Site index · List index
Message view « Date » · « Thread »
Top « Date » · « Thread »
From Apache Jenkins Server <jenk...@builds.apache.org>
Subject Build failed in Jenkins: aurora-packaging-nightly #675
Date Fri, 26 May 2017 01:54:18 GMT
See <https://builds.apache.org/job/aurora-packaging-nightly/675/display/redirect>

------------------------------------------
[...truncated 11.78 MB...]
> Configuring > 0/5 projects > root project > Resolving dependencies ':classpath'
                                                                                         
        
Download https://plugins.gradle.org/m2/org/apache/maven/maven-parent/8/maven-parent-8.pom
> Configuring > 0/5 projects > root project > Resolving dependencies ':classpath'
                                                                                        
Download https://plugins.gradle.org/m2/org/apache/xbean/xbean-reflect/3.4/xbean-reflect-3.4.pom
> Configuring > 0/5 projects > root project > Resolving dependencies ':classpath'
                                                                                         
    
Download https://plugins.gradle.org/m2/org/apache/xbean/xbean/3.4/xbean-3.4.pom
> Configuring > 0/5 projects > root project > Resolving dependencies ':classpath'
                                                                              
Download https://plugins.gradle.org/m2/com/google/code/google-collections/google-collect/snapshot-20080530/google-collect-snapshot-20080530.pom
> Configuring > 0/5 projects > root project > Resolving dependencies ':classpath'
                                                                                         
                                                    
Download https://plugins.gradle.org/m2/stax/stax-api/1.0.1/stax-api-1.0.1.pom
> Configuring > 0/5 projects > root project > Resolving dependencies ':classpath'
                                                                            
Download https://plugins.gradle.org/m2/org/sonatype/sisu/sisu-guice/2.9.1/sisu-guice-2.9.1.pom
> Configuring > 0/5 projects > root project > Resolving dependencies ':classpath'
                                                                                         
   
Download https://plugins.gradle.org/m2/org/sonatype/sisu/inject/guice-parent/2.9.1/guice-parent-2.9.1.pom
> Configuring > 0/5 projects > root project > Resolving dependencies ':classpath'
                                                                                         
              
Download https://plugins.gradle.org/m2/log4j/log4j/1.2.12/log4j-1.2.12.pom
> Configuring > 0/5 projects > root project > Resolving dependencies ':classpath'
                                                                         
Download https://plugins.gradle.org/m2/commons-logging/commons-logging-api/1.1/commons-logging-api-1.1.pom
> Configuring > 0/5 projects > root project > Resolving dependencies ':classpath'
                                                                                         
               
Download https://plugins.gradle.org/m2/com/eriwen/gradle-js-plugin/1.12.1/gradle-js-plugin-1.12.1.jar
Download https://plugins.gradle.org/m2/com/github/ben-manes/gradle-versions-plugin/0.11.3/gradle-versions-plugin-0.11.3.jar
> Configuring > 0/5 projects > root projectDownload https://plugins.gradle.org/m2/nl/javadude/gradle/plugins/license-gradle-plugin/0.11.0/license-gradle-plugin-0.11.0.jar
Download https://plugins.gradle.org/m2/me/champeau/gradle/jmh-gradle-plugin/0.2.0/jmh-gradle-plugin-0.2.0.jar
> Configuring > 0/5 projects > root projectDownload https://plugins.gradle.org/m2/com/google/javascript/closure-compiler/v20131014/closure-compiler-v20131014.jar
> Configuring > 0/5 projects > root project > 1.91 MB/3.42 MB downloaded     
                                                                                         
                      
> Configuring > 0/5 projects > root projectDownload https://plugins.gradle.org/m2/io/jdev/html2js/html2js/0.1/html2js-0.1.jar
Download https://plugins.gradle.org/m2/com/thoughtworks/xstream/xstream/1.4.7/xstream-1.4.7.jar
> Configuring > 0/5 projects > root projectDownload https://plugins.gradle.org/m2/com/mycila/maven-license-plugin/maven-license-plugin/1.10.b1/maven-license-plugin-1.10.b1.jar
Download https://plugins.gradle.org/m2/com/google/guava/guava/17.0/guava-17.0.jar
> Configuring > 0/5 projects > root project > 1.00 MB/2.14 MB downloaded     
                                                                           
> Configuring > 0/5 projects > root projectDownload https://plugins.gradle.org/m2/args4j/args4j/2.0.16/args4j-2.0.16.jar
> Configuring > 0/5 projects > root project                                     
                                       
Download https://plugins.gradle.org/m2/com/google/protobuf/protobuf-java/2.4.1/protobuf-java-2.4.1.jar
> Configuring > 0/5 projects > root projectDownload https://plugins.gradle.org/m2/org/json/json/20090211/json-20090211.jar
> Configuring > 0/5 projects > root projectDownload https://plugins.gradle.org/m2/com/google/code/findbugs/jsr305/1.3.9/jsr305-1.3.9.jar
Download https://plugins.gradle.org/m2/xmlpull/xmlpull/1.1.3.1/xmlpull-1.1.3.1.jar
> Configuring > 0/5 projects > root projectDownload https://plugins.gradle.org/m2/xpp3/xpp3_min/1.1.4c/xpp3_min-1.1.4c.jar
Download https://plugins.gradle.org/m2/org/apache/maven/maven-plugin-api/3.0.1/maven-plugin-api-3.0.1.jar
> Configuring > 0/5 projects > root projectDownload https://plugins.gradle.org/m2/com/mycila/xmltool/xmltool/3.3/xmltool-3.3.jar
Download https://plugins.gradle.org/m2/org/apache/maven/maven-project/3.0-alpha-2/maven-project-3.0-alpha-2.jar
> Configuring > 0/5 projects > root projectDownload https://plugins.gradle.org/m2/org/codehaus/plexus/plexus-utils/2.0.5/plexus-utils-2.0.5.jar
Download https://plugins.gradle.org/m2/org/apache/maven/maven-model/3.0.1/maven-model-3.0.1.jar
> Configuring > 0/5 projects > root projectDownload https://plugins.gradle.org/m2/org/apache/maven/maven-artifact/3.0.1/maven-artifact-3.0.1.jar
Download https://plugins.gradle.org/m2/org/sonatype/sisu/sisu-inject-plexus/1.4.3.1/sisu-inject-plexus-1.4.3.1.jar
> Configuring > 0/5 projects > root projectDownload https://plugins.gradle.org/m2/org/codehaus/plexus/plexus-interpolation/1.1/plexus-interpolation-1.1.jar
Download https://plugins.gradle.org/m2/org/apache/maven/maven-compat/3.0-alpha-2/maven-compat-3.0-alpha-2.jar
> Configuring > 0/5 projects > root projectDownload https://plugins.gradle.org/m2/org/codehaus/plexus/plexus-container-default/1.0-beta-3.0.5/plexus-container-default-1.0-beta-3.0.5.jar
Download https://plugins.gradle.org/m2/org/codehaus/woodstox/wstx-asl/3.2.6/wstx-asl-3.2.6.jar
> Configuring > 0/5 projects > root projectDownload https://plugins.gradle.org/m2/org/sonatype/spice/model-builder/1.3/model-builder-1.3.jar
Download https://plugins.gradle.org/m2/org/apache/maven/maven-project-builder/3.0-alpha-2/maven-project-builder-3.0-alpha-2.jar
> Configuring > 0/5 projects > root projectDownload https://plugins.gradle.org/m2/org/codehaus/plexus/plexus-component-annotations/1.5.5/plexus-component-annotations-1.5.5.jar
Download https://plugins.gradle.org/m2/org/codehaus/plexus/plexus-classworlds/2.2.3/plexus-classworlds-2.2.3.jar
> Configuring > 0/5 projects > root projectDownload https://plugins.gradle.org/m2/org/sonatype/sisu/sisu-inject-bean/1.4.3.1/sisu-inject-bean-1.4.3.1.jar
Download https://plugins.gradle.org/m2/org/apache/maven/wagon/wagon-provider-api/1.0-beta-4/wagon-provider-api-1.0-beta-4.jar
> Configuring > 0/5 projects > root projectDownload https://plugins.gradle.org/m2/org/apache/xbean/xbean-reflect/3.4/xbean-reflect-3.4.jar
Download https://plugins.gradle.org/m2/com/google/code/google-collections/google-collect/snapshot-20080530/google-collect-snapshot-20080530.jar
> Configuring > 0/5 projects > root projectDownload https://plugins.gradle.org/m2/stax/stax-api/1.0.1/stax-api-1.0.1.jar
Download https://plugins.gradle.org/m2/org/sonatype/sisu/sisu-guice/2.9.1/sisu-guice-2.9.1-noaop.jar
> Configuring > 0/5 projects > root projectDownload https://plugins.gradle.org/m2/log4j/log4j/1.2.12/log4j-1.2.12.jar
Download https://plugins.gradle.org/m2/commons-logging/commons-logging-api/1.1/commons-logging-api-1.1.jar
> Configuring > 0/5 projects > root project> Configuring > 0/5 projects >
root project > Compiling /scratch/build.gradle into local build cache> Configuring >
0/5 projects > root project > Compiling /scratch/build.gradle into local build cache
> Compiling build file '/scratch/build.gradle' to cross build script cache> Configuring
> 0/5 projects > root project > Compiling /scratch/build.gradle into local build
cache> Configuring > 0/5 projects > root project> Configuring > 0/5 projects>
Configuring > 2/5 projects > :buildSrc > Compiling /scratch/buildSrc/build.gradle
into local build cache > Compiling build file '/scratch/buildSrc/build.gradle' to cross
build script cache> Configuring > 5/5 projects:enforceVersion UP-TO-DATE
> Building 3% > :api:generateThriftJava:api:generateThriftJava
> Building 3%:api:classesThrift
Download https://repo1.maven.org/maven2/org/apache/thrift/libthrift/0.9.1/libthrift-0.9.1.pom
Download https://repo1.maven.org/maven2/org/slf4j/slf4j-api/1.5.8/slf4j-api-1.5.8.pom
Download https://repo1.maven.org/maven2/org/slf4j/slf4j-parent/1.5.8/slf4j-parent-1.5.8.pom
Download https://repo1.maven.org/maven2/org/apache/commons/commons-lang3/3.1/commons-lang3-3.1.pom
Download https://repo1.maven.org/maven2/org/apache/commons/commons-parent/22/commons-parent-22.pom
> Building 6% > :api:classesThrift > Resolving dependencies ':api:thriftCompile'Download
https://repo1.maven.org/maven2/org/apache/apache/9/apache-9.pom
Download https://repo1.maven.org/maven2/org/apache/httpcomponents/httpclient/4.2.5/httpclient-4.2.5.pom
Download https://repo1.maven.org/maven2/org/apache/httpcomponents/httpcomponents-client/4.2.5/httpcomponents-client-4.2.5.pom
Download https://repo1.maven.org/maven2/org/apache/httpcomponents/project/6/project-6.pom
Download https://repo1.maven.org/maven2/org/apache/httpcomponents/httpcore/4.2.4/httpcore-4.2.4.pom
Download https://repo1.maven.org/maven2/org/apache/httpcomponents/httpcomponents-core/4.2.4/httpcomponents-core-4.2.4.pom
Download https://repo1.maven.org/maven2/commons-logging/commons-logging/1.1.1/commons-logging-1.1.1.pom
Download https://repo1.maven.org/maven2/org/apache/commons/commons-parent/5/commons-parent-5.pom
> Building 6% > :api:classesThrift > Resolving dependencies ':api:thriftCompile'Download
https://repo1.maven.org/maven2/commons-codec/commons-codec/1.6/commons-codec-1.6.pom
Download https://repo1.maven.org/maven2/org/apache/thrift/libthrift/0.9.1/libthrift-0.9.1.jar
Download https://repo1.maven.org/maven2/org/slf4j/slf4j-api/1.5.8/slf4j-api-1.5.8.jar
Download https://repo1.maven.org/maven2/org/apache/commons/commons-lang3/3.1/commons-lang3-3.1.jar
Download https://repo1.maven.org/maven2/org/apache/httpcomponents/httpclient/4.2.5/httpclient-4.2.5.jar
Download https://repo1.maven.org/maven2/org/apache/httpcomponents/httpcore/4.2.4/httpcore-4.2.4.jar
> Building 6% > :api:classesThrift > 15 KB/221 KB downloaded                    
                                                                              
Download https://repo1.maven.org/maven2/commons-logging/commons-logging/1.1.1/commons-logging-1.1.1.jar
Download https://repo1.maven.org/maven2/commons-codec/commons-codec/1.6/commons-codec-1.6.jar
> Building 6% > :api:classesThriftAn exception has occurred in the compiler (1.8.0_111).
Please file a bug against the Java compiler via the Java bug reporting page (http://bugreport.java.com)
after checking the Bug Database (http://bugs.java.com) for duplicates. Include your program
and the following diagnostic in your report. Thank you.
> Building 6% > :api:classesThriftjava.lang.NullPointerException
        at com.sun.tools.javac.code.Scope.getIndex(Scope.java:348)
        at com.sun.tools.javac.code.Scope.lookup(Scope.java:325)
        at com.sun.tools.javac.code.Scope.remove(Scope.java:248)
        at com.sun.tools.javac.comp.Resolve.findImmediateMemberType(Resolve.java:1932)
        at com.sun.tools.javac.comp.Resolve.findMemberType(Resolve.java:1990)
        at com.sun.tools.javac.comp.Resolve.findInheritedMemberType(Resolve.java:1961)
        at com.sun.tools.javac.comp.Resolve.findMemberType(Resolve.java:1995)
        at com.sun.tools.javac.comp.Resolve.findInheritedMemberType(Resolve.java:1967)
        at com.sun.tools.javac.comp.Resolve.findMemberType(Resolve.java:1995)
        at com.sun.tools.javac.comp.Resolve.findInheritedMemberType(Resolve.java:1967)
        at com.sun.tools.javac.comp.Resolve.findMemberType(Resolve.java:1995)
        at com.sun.tools.javac.comp.Resolve.findInheritedMemberType(Resolve.java:1961)
        at com.sun.tools.javac.comp.Resolve.findType(Resolve.java:2059)
        at com.sun.tools.javac.comp.Resolve.findIdent(Resolve.java:2110)
        at com.sun.tools.javac.comp.Resolve.resolveIdent(Resolve.java:2384)
        at com.sun.tools.javac.comp.Attr.visitIdent(Attr.java:3170)
        at com.sun.tools.javac.tree.JCTree$JCIdent.accept(JCTree.java:2011)
        at com.sun.tools.javac.comp.Attr.attribTree(Attr.java:576)
        at com.sun.tools.javac.comp.Attr.attribType(Attr.java:638)
        at com.sun.tools.javac.comp.Attr.attribType(Attr.java:631)
        at com.sun.tools.javac.comp.Attr.visitNewClass(Attr.java:1970)
        at com.sun.tools.javac.tree.JCTree$JCNewClass.accept(JCTree.java:1516)
        at com.sun.tools.javac.comp.Attr.attribTree(Attr.java:576)
        at com.sun.tools.javac.comp.Attr.attribExpr(Attr.java:618)
        at com.sun.tools.javac.comp.Attr.visitThrow(Attr.java:1697)
        at com.sun.tools.javac.tree.JCTree$JCThrow.accept(JCTree.java:1407)
        at com.sun.tools.javac.comp.Attr.attribTree(Attr.java:576)
        at com.sun.tools.javac.comp.Attr.attribStat(Attr.java:645)
        at com.sun.tools.javac.comp.Attr.visitIf(Attr.java:1582)
        at com.sun.tools.javac.tree.JCTree$JCIf.accept(JCTree.java:1269)
        at com.sun.tools.javac.comp.Attr.attribTree(Attr.java:576)
        at com.sun.tools.javac.comp.Attr.attribStat(Attr.java:645)
        at com.sun.tools.javac.comp.Attr.attribStats(Attr.java:661)
        at com.sun.tools.javac.comp.Attr.visitBlock(Attr.java:1124)
        at com.sun.tools.javac.tree.JCTree$JCBlock.accept(JCTree.java:909)
        at com.sun.tools.javac.comp.Attr.attribTree(Attr.java:576)
        at com.sun.tools.javac.comp.Attr.attribStat(Attr.java:645)
        at com.sun.tools.javac.comp.Attr.visitMethodDef(Attr.java:1013)
        at com.sun.tools.javac.tree.JCTree$JCMethodDecl.accept(JCTree.java:778)
        at com.sun.tools.javac.comp.Attr.attribTree(Attr.java:576)
        at com.sun.tools.javac.comp.Attr.attribStat(Attr.java:645)
        at com.sun.tools.javac.comp.Attr.attribClassBody(Attr.java:4364)
        at com.sun.tools.javac.comp.Attr.attribClass(Attr.java:4272)
        at com.sun.tools.javac.comp.Attr.attribClass(Attr.java:4201)
        at com.sun.tools.javac.comp.Attr.attrib(Attr.java:4176)
        at com.sun.tools.javac.main.JavaCompiler.attribute(JavaCompiler.java:1248)
        at com.sun.tools.javac.main.JavaCompiler.compile2(JavaCompiler.java:901)
        at com.sun.tools.javac.main.JavaCompiler.compile(JavaCompiler.java:860)
        at com.sun.tools.javac.main.Main.compile(Main.java:523)
        at com.sun.tools.javac.api.JavacTaskImpl.doCall(JavacTaskImpl.java:129)
        at com.sun.tools.javac.api.JavacTaskImpl.call(JavacTaskImpl.java:138)
        at org.gradle.api.internal.tasks.compile.JdkJavaCompiler.execute(JdkJavaCompiler.java:46)
        at org.gradle.api.internal.tasks.compile.JdkJavaCompiler.execute(JdkJavaCompiler.java:33)
        at org.gradle.api.internal.tasks.compile.NormalizingJavaCompiler.delegateAndHandleErrors(NormalizingJavaCompiler.java:104)
        at org.gradle.api.internal.tasks.compile.NormalizingJavaCompiler.execute(NormalizingJavaCompiler.java:53)
        at org.gradle.api.internal.tasks.compile.NormalizingJavaCompiler.execute(NormalizingJavaCompiler.java:38)
        at org.gradle.api.internal.tasks.compile.CleaningJavaCompilerSupport.execute(CleaningJavaCompilerSupport.java:35)
        at org.gradle.api.internal.tasks.compile.CleaningJavaCompilerSupport.execute(CleaningJavaCompilerSupport.java:25)
        at org.gradle.api.tasks.compile.JavaCompile.performCompilation(JavaCompile.java:189)
        at org.gradle.api.tasks.compile.JavaCompile.compile(JavaCompile.java:170)
        at org.gradle.api.tasks.compile.JavaCompile.compile(JavaCompile.java:113)
        at sun.reflect.NativeMethodAccessorImpl.invoke0(Native Method)
        at sun.reflect.NativeMethodAccessorImpl.invoke(NativeMethodAccessorImpl.java:62)
        at sun.reflect.DelegatingMethodAccessorImpl.invoke(DelegatingMethodAccessorImpl.java:43)
        at java.lang.reflect.Method.invoke(Method.java:498)
        at org.gradle.internal.reflect.JavaMethod.invoke(JavaMethod.java:75)
        at org.gradle.api.internal.project.taskfactory.DefaultTaskClassInfoStore$IncrementalTaskAction.doExecute(DefaultTaskClassInfoStore.java:158)
        at org.gradle.api.internal.project.taskfactory.DefaultTaskClassInfoStore$StandardTaskAction.execute(DefaultTaskClassInfoStore.java:129)
        at org.gradle.api.internal.project.taskfactory.DefaultTaskClassInfoStore$StandardTaskAction.execute(DefaultTaskClassInfoStore.java:118)
        at org.gradle.api.internal.tasks.execution.ExecuteActionsTaskExecuter.executeAction(ExecuteActionsTaskExecuter.java:80)
        at org.gradle.api.internal.tasks.execution.ExecuteActionsTaskExecuter.executeActions(ExecuteActionsTaskExecuter.java:61)
        at org.gradle.api.internal.tasks.execution.ExecuteActionsTaskExecuter.execute(ExecuteActionsTaskExecuter.java:46)
        at org.gradle.api.internal.tasks.execution.PostExecutionAnalysisTaskExecuter.execute(PostExecutionAnalysisTaskExecuter.java:35)
        at org.gradle.api.internal.tasks.execution.SkipUpToDateTaskExecuter.execute(SkipUpToDateTaskExecuter.java:64)
        at org.gradle.api.internal.tasks.execution.ValidatingTaskExecuter.execute(ValidatingTaskExecuter.java:58)
        at org.gradle.api.internal.tasks.execution.SkipEmptySourceFilesTaskExecuter.execute(SkipEmptySourceFilesTaskExecuter.java:52)
        at org.gradle.api.internal.tasks.execution.SkipTaskWithNoActionsExecuter.execute(SkipTaskWithNoActionsExecuter.java:52)
        at org.gradle.api.internal.tasks.execution.SkipOnlyIfTaskExecuter.execute(SkipOnlyIfTaskExecuter.java:53)
        at org.gradle.api.internal.tasks.execution.ExecuteAtMostOnceTaskExecuter.execute(ExecuteAtMostOnceTaskExecuter.java:43)
        at org.gradle.execution.taskgraph.DefaultTaskGraphExecuter$EventFiringTaskWorker.execute(DefaultTaskGraphExecuter.java:233)
        at org.gradle.execution.taskgraph.DefaultTaskGraphExecuter$EventFiringTaskWorker.execute(DefaultTaskGraphExecuter.java:215)
        at org.gradle.execution.taskgraph.AbstractTaskPlanExecutor$TaskExecutorWorker.processTask(AbstractTaskPlanExecutor.java:74)
        at org.gradle.execution.taskgraph.AbstractTaskPlanExecutor$TaskExecutorWorker.run(AbstractTaskPlanExecutor.java:55)
        at org.gradle.execution.taskgraph.DefaultTaskPlanExecutor.process(DefaultTaskPlanExecutor.java:32)
        at org.gradle.execution.taskgraph.DefaultTaskGraphExecuter.execute(DefaultTaskGraphExecuter.java:113)
        at org.gradle.execution.SelectedTaskExecutionAction.execute(SelectedTaskExecutionAction.java:37)
        at org.gradle.execution.DefaultBuildExecuter.execute(DefaultBuildExecuter.java:37)
        at org.gradle.execution.DefaultBuildExecuter.access$000(DefaultBuildExecuter.java:23)
        at org.gradle.execution.DefaultBuildExecuter$1.proceed(DefaultBuildExecuter.java:43)
        at org.gradle.execution.DryRunBuildExecutionAction.execute(DryRunBuildExecutionAction.java:32)
        at org.gradle.execution.DefaultBuildExecuter.execute(DefaultBuildExecuter.java:37)
        at org.gradle.execution.DefaultBuildExecuter.execute(DefaultBuildExecuter.java:30)
        at org.gradle.initialization.DefaultGradleLauncher$4.run(DefaultGradleLauncher.java:186)
        at org.gradle.internal.Factories$1.create(Factories.java:22)
        at org.gradle.internal.progress.DefaultBuildOperationExecutor.run(DefaultBuildOperationExecutor.java:91)
        at org.gradle.internal.progress.DefaultBuildOperationExecutor.run(DefaultBuildOperationExecutor.java:53)
        at org.gradle.initialization.DefaultGradleLauncher.doBuildStages(DefaultGradleLauncher.java:183)
        at org.gradle.initialization.DefaultGradleLauncher.access$200(DefaultGradleLauncher.java:33)
        at org.gradle.initialization.DefaultGradleLauncher$1.create(DefaultGradleLauncher.java:112)
        at org.gradle.initialization.DefaultGradleLauncher$1.create(DefaultGradleLauncher.java:106)
        at org.gradle.internal.progress.DefaultBuildOperationExecutor.run(DefaultBuildOperationExecutor.java:91)
        at org.gradle.internal.progress.DefaultBuildOperationExecutor.run(DefaultBuildOperationExecutor.java:63)
        at org.gradle.initialization.DefaultGradleLauncher.doBuild(DefaultGradleLauncher.java:106)
        at org.gradle.initialization.DefaultGradleLauncher.run(DefaultGradleLauncher.java:92)
        at org.gradle.launcher.exec.GradleBuildController.run(GradleBuildController.java:66)
        at org.gradle.tooling.internal.provider.ExecuteBuildActionRunner.run(ExecuteBuildActionRunner.java:28)
        at org.gradle.launcher.exec.ChainingBuildActionRunner.run(ChainingBuildActionRunner.java:35)
        at org.gradle.launcher.exec.InProcessBuildActionExecuter.execute(InProcessBuildActionExecuter.java:41)
        at org.gradle.launcher.exec.InProcessBuildActionExecuter.execute(InProcessBuildActionExecuter.java:26)
        at org.gradle.tooling.internal.provider.ContinuousBuildActionExecuter.execute(ContinuousBuildActionExecuter.java:79)
        at org.gradle.tooling.internal.provider.ContinuousBuildActionExecuter.execute(ContinuousBuildActionExecuter.java:51)
        at org.gradle.launcher.daemon.server.exec.ExecuteBuild.doBuild(ExecuteBuild.java:59)
        at org.gradle.launcher.daemon.server.exec.BuildCommandOnly.execute(BuildCommandOnly.java:36)
        at org.gradle.launcher.daemon.server.api.DaemonCommandExecution.proceed(DaemonCommandExecution.java:120)
        at org.gradle.launcher.daemon.server.exec.WatchForDisconnection.execute(WatchForDisconnection.java:47)
        at org.gradle.launcher.daemon.server.api.DaemonCommandExecution.proceed(DaemonCommandExecution.java:120)
        at org.gradle.launcher.daemon.server.exec.ResetDeprecationLogger.execute(ResetDeprecationLogger.java:26)
        at org.gradle.launcher.daemon.server.api.DaemonCommandExecution.proceed(DaemonCommandExecution.java:120)
        at org.gradle.launcher.daemon.server.exec.RequestStopIfSingleUsedDaemon.execute(RequestStopIfSingleUsedDaemon.java:34)
        at org.gradle.launcher.daemon.server.api.DaemonCommandExecution.proceed(DaemonCommandExecution.java:120)
        at org.gradle.launcher.daemon.server.exec.ForwardClientInput$2.call(ForwardClientInput.java:74)
        at org.gradle.launcher.daemon.server.exec.ForwardClientInput$2.call(ForwardClientInput.java:72)
        at org.gradle.util.Swapper.swap(Swapper.java:38)
        at org.gradle.launcher.daemon.server.exec.ForwardClientInput.execute(ForwardClientInput.java:72)
        at org.gradle.launcher.daemon.server.api.DaemonCommandExecution.proceed(DaemonCommandExecution.java:120)
        at org.gradle.launcher.daemon.server.exec.LogAndCheckHealth.execute(LogAndCheckHealth.java:55)
        at org.gradle.launcher.daemon.server.api.DaemonCommandExecution.proceed(DaemonCommandExecution.java:120)
        at org.gradle.launcher.daemon.server.exec.LogToClient.doBuild(LogToClient.java:60)
        at org.gradle.launcher.daemon.server.exec.BuildCommandOnly.execute(BuildCommandOnly.java:36)
        at org.gradle.launcher.daemon.server.api.DaemonCommandExecution.proceed(DaemonCommandExecution.java:120)
        at org.gradle.launcher.daemon.server.exec.EstablishBuildEnvironment.doBuild(EstablishBuildEnvironment.java:72)
        at org.gradle.launcher.daemon.server.exec.BuildCommandOnly.execute(BuildCommandOnly.java:36)
        at org.gradle.launcher.daemon.server.api.DaemonCommandExecution.proceed(DaemonCommandExecution.java:120)
        at org.gradle.launcher.daemon.server.exec.HintGCAfterBuild.execute(HintGCAfterBuild.java:44)
        at org.gradle.launcher.daemon.server.api.DaemonCommandExecution.proceed(DaemonCommandExecution.java:120)
        at org.gradle.launcher.daemon.server.exec.StartBuildOrRespondWithBusy$1.run(StartBuildOrRespondWithBusy.java:50)
        at org.gradle.launcher.daemon.server.DaemonStateCoordinator$1.run(DaemonStateCoordinator.java:293)
        at org.gradle.internal.concurrent.ExecutorPolicy$CatchAndRecordFailures.onExecute(ExecutorPolicy.java:54)
        at org.gradle.internal.concurrent.StoppableExecutorImpl$1.run(StoppableExecutorImpl.java:40)
        at java.util.concurrent.ThreadPoolExecutor.runWorker(ThreadPoolExecutor.java:1142)
        at java.util.concurrent.ThreadPoolExecutor$Worker.run(ThreadPoolExecutor.java:617)
        at java.lang.Thread.run(Thread.java:745)
:api:classesThrift FAILED

FAILURE: Build failed with an exception.

* What went wrong:
Execution failed for task ':api:classesThrift'.
> Compilation failed; see the compiler error output for details.

* Try:
Run with --stacktrace option to get the stack trace. Run with --info or --debug option to
get more log output.

BUILD FAILED

Total time: 51.657 secs
make[1]: *** [__gradle_build] Error 1
make[1]: Leaving directory `/scratch'
make: *** [build] Error 2
dpkg-buildpackage: error: debian/rules build gave error exit status 2
Build step 'Execute shell' marked build as failure
Skipped archiving because build is not successful

Mime
View raw message