aurora-dev mailing list archives

Site index · List index
Message view « Date » · « Thread »
Top « Date » · « Thread »
From Apache Jenkins Server <jenk...@builds.apache.org>
Subject Build failed in Jenkins: aurora-packaging-nightly #655
Date Sat, 06 May 2017 01:47:47 GMT
See <https://builds.apache.org/job/aurora-packaging-nightly/655/display/redirect>

------------------------------------------
[...truncated 12.42 MB...]
Processing triggers for man-db (2.7.5-1) ...
Setting up gdebi-core (0.9.5.7ubuntu1) ...
Reading package lists... 0%Reading package lists... 0%Reading package lists... 1%Reading package
lists... 12%Reading package lists... 12%Reading package lists... 12%Reading package lists...
12%Reading package lists... 33%Reading package lists... 69%Reading package lists... 82%Reading
package lists... 82%Reading package lists... 83%Reading package lists... 83%Reading package
lists... 89%Reading package lists... 89%Reading package lists... 89%Reading package lists...
89%Reading package lists... 95%Reading package lists... 95%Reading package lists... 95%Reading
package lists... 95%Reading package lists... 95%Reading package lists... 95%Reading package
lists... 95%Reading package lists... 95%Reading package lists... 97%Reading package lists...
97%Reading package lists... 98%Reading package lists... 98%Reading package lists... 99%Reading
package lists... 99%Reading package lists... 99%Reading package lists... 99%Reading package
lists... 99%Reading package lists... 99%Reading package lists... Done
Building dependency tree... 0%Building dependency tree... 0%Building dependency tree... 29%Building
dependency tree... 50%Building dependency tree... 50%Building dependency tree        
Reading state information... 0%Reading state information... 0%Reading state information...
Done
Reading state information... 0%  Reading state information... 1%  Reading state information...
3%  Reading state information... 5%  Reading state information... 7%  Reading state information...
9%  Reading state information... 11% Reading state information... 13% Reading state information...
15% Reading state information... 17% Reading state information... 19% Reading state information...
21% Reading state information... 23% Reading state information... 25% Reading state information...
27% Reading state information... 29% Reading state information... 31% Reading state information...
33% Reading state information... 35% Reading state information... 37% Reading state information...
39% Reading state information... 41% Reading state information... 43% Reading state information...
45% Reading state information... 47% Reading state information... 49% Reading state information...
51% Reading state information... 53% Reading state information... 55% Reading state information...
57% Reading state information... 59% Reading state information... 61% Reading state information...
63% Reading state information... 65% Reading state information... 67% Reading state information...
69% Reading state information... 71% Reading state information... 73% Reading state information...
75% Reading state information... 77% Reading state information... 79% Reading state information...
81% Reading state information... 83% Reading state information... 85% Reading state information...
87% Reading state information... 89% Reading state information... 91% Reading state information...
93% Reading state information... 95% Reading state information... 97% Reading state information...
99% Selecting previously unselected package gradle-3.1.
(Reading database ... 27719 files and directories currently installed.)
Preparing to unpack gradle-3.1_3.1-2_all.deb ...
Unpacking gradle-3.1 (3.1-2) ...
Setting up gradle-3.1 (3.1-2) ...
update-alternatives: using /opt/gradle-3.1/bin/gradle to provide /usr/bin/gradle (gradle)
in auto mode
Reading state information... Done
 ---> d5de5d538f70
Removing intermediate container 2950ff2f3bb7
Step 9/9 : ADD build.sh /build.sh
 ---> bbe6b4a4b958
Removing intermediate container e210a88fe62e
Successfully built bbe6b4a4b958
+ mkdir /scratch
+ cd /scratch
+ tar --strip-components 1 -C . -xf /src.tar.gz
+ cp -R /specs/debian .
+ rm ./debian/aurora-executor.thermos.upstart ./debian/aurora-scheduler.upstart ./debian/aurora-executor.thermos.init
./debian/aurora-scheduler.init
++ lsb_release -is
++ tr '[:upper:]' '[:lower:]'
+ DISTRO=ubuntu
++ lsb_release -cs
++ tr '[:upper:]' '[:lower:]'
+ CODENAME=xenial
+ THIRD_PARTY_REPO=https://svn.apache.org/repos/asf/aurora/3rdparty/
+ THIRD_PARTY_REPO+=ubuntu/xenial64/python/
+ echo '[python-repos]'
+ echo 'repos: ['\''third_party/'\'', '\''https://svn.apache.org/repos/asf/aurora/3rdparty/ubuntu/xenial64/python/'\'']'
+ export 'DEBFULLNAME=Apache Aurora'
+ DEBFULLNAME='Apache Aurora'
+ export DEBEMAIL=dev@aurora.apache.org
+ DEBEMAIL=dev@aurora.apache.org
++ date -R
+ dch --newversion 0.18.0-SNAPSHOT.2017.05.06 --package apache-aurora --urgency medium 'Apache
Aurora package builder <dev@aurora.apache.org> Sat, 06 May 2017 01:46:25 +0000'
dch warning: Previous package version was Debian native whilst new version is not
+ dch --release ''
+ dpkg-buildpackage -uc -b -tc
dpkg-buildpackage: source package apache-aurora
dpkg-buildpackage: source version 0.18.0-SNAPSHOT.2017.05.06
dpkg-buildpackage: source distribution xenial
dpkg-buildpackage: source changed by Apache Aurora <dev@aurora.apache.org>
dpkg-buildpackage: host architecture amd64
 dpkg-source --before-build scratch
 debian/rules clean
dh clean --exclude=aurora-scheduler.bat --with=systemd
   dh_testdir -O--exclude=aurora-scheduler.bat
   dh_auto_clean -O--exclude=aurora-scheduler.bat
   dh_clean -O--exclude=aurora-scheduler.bat
 debian/rules build
dh build --exclude=aurora-scheduler.bat --with=systemd
   dh_testdir -O--exclude=aurora-scheduler.bat
   dh_update_autotools_config -O--exclude=aurora-scheduler.bat
   dh_auto_configure -O--exclude=aurora-scheduler.bat
   debian/rules override_dh_auto_build
make[1]: Entering directory '/scratch'
/usr/bin/gradle installDist
Starting a Gradle Daemon (subsequent builds will be faster)
> Starting Daemon> Starting Daemon > Connecting to Daemon> LoadingInvalidating
buildSrc state cache (/scratch/buildSrc/.gradle/noVersion/buildSrc) as it was not closed cleanly.
> Loading > buildSrc > settings> Loading > buildSrc> Loading > buildSrc
> Compiling jar:file:/opt/gradle-3.1/lib/gradle-core-3.1.jar!/org/gradle/initialization/buildsrc/defaultBuildSourceScript.txt
into local build cache> Loading > buildSrc > Compiling jar:file:/opt/gradle-3.1/lib/gradle-core-3.1.jar!/org/gradle/initialization/buildsrc/defaultBuildSourceScript.txt
into local build cache > Compiling script 'jar:file:/opt/gradle-3.1/lib/gradle-core-3.1.jar!/org/gradle/initialization/buildsrc/defaultBuildSourceScript.txt'
to cross build script cache> Loading > buildSrc > Compiling jar:file:/opt/gradle-3.1/lib/gradle-core-3.1.jar!/org/gradle/initialization/buildsrc/defaultBuildSourceScript.txt
into local build cache> Loading > buildSrc > Compiling jar:file:/opt/gradle-3.1/lib/gradle-core-3.1.jar!/org/gradle/initialization/buildsrc/defaultBuildSourceScript.txt
into local build cache > Compiling script 'jar:file:/opt/gradle-3.1/lib/gradle-core-3.1.jar!/org/gradle/initialization/buildsrc/defaultBuildSourceScript.txt'
to cross build script cache> Loading > buildSrc > Compiling jar:file:/opt/gradle-3.1/lib/gradle-core-3.1.jar!/org/gradle/initialization/buildsrc/defaultBuildSourceScript.txt
into local build cache> Loading > buildSrcGenerating JAR file 'gradle-api-3.1.jar'
> Loading > buildSrc> Loading > buildSrc > Generating 0%> Loading > buildSrc
> Generating 1%> Loading > buildSrc > Generating 2%> Loading > buildSrc
> Generating 3%> Loading > buildSrc > Generating 4%> Loading > buildSrc
> Generating 8%> Loading > buildSrc > Generating 9%> Loading > buildSrc
> Generating 10%> Loading > buildSrc > Generating 13%> Loading > buildSrc
> Generating 20%> Loading > buildSrc > Generating 24%> Loading > buildSrc
> Generating 25%> Loading > buildSrc > Generating 26%> Loading > buildSrc
> Generating 27%> Loading > buildSrc > Generating 28%> Loading > buildSrc
> Generating 29%> Loading > buildSrc > Generating 30%> Loading > buildSrc
> Generating 31%> Loading > buildSrc > Generating 36%> Loading > buildSrc
> Generating 38%> Loading > buildSrc > Generating 40%> Loading > buildSrc
> Generating 42%> Loading > buildSrc > Generating 45%> Loading > buildSrc
> Generating 47%> Loading > buildSrc > Generating 48%> Loading > buildSrc
> Generating 49%> Loading > buildSrc > Generating 50%> Loading > buildSrc
> Generating 51%> Loading > buildSrc > Generating 52%> Loading > buildSrc
> Generating 54%> Loading > buildSrc > Generating 56%> Loading > buildSrc
> Generating 57%> Loading > buildSrc > Generating 58%> Loading > buildSrc
> Generating 59%> Loading > buildSrc > Generating 62%> Loading > buildSrc
> Generating 63%> Loading > buildSrc > Generating 64%> Loading > buildSrc
> Generating 65%> Loading > buildSrc > Generating 67%> Loading > buildSrc
> Generating 69%> Loading > buildSrc > Generating 70%> Loading > buildSrc
> Generating 72%> Loading > buildSrc > Generating 75%> Loading > buildSrc
> Generating 76%> Loading > buildSrc > Generating 77%> Loading > buildSrc
> Generating 78%> Loading > buildSrc > Generating 80%> Loading > buildSrc
> Generating 84%> Loading > buildSrc > Generating 85%> Loading > buildSrc
> Generating 86%> Loading > buildSrc > Generating 87%> Loading > buildSrc
> Generating 88%> Loading > buildSrc > Generating 89%> Loading > buildSrc
> Generating 90%> Loading > buildSrc > Generating 92%> Loading > buildSrc
> Generating 93%> Loading > buildSrc > Generating 94%> Loading > buildSrc
> Generating 95%> Loading > buildSrc > Generating 96%> Loading > buildSrc
> Generating 100%                                        
> Loading > buildSrc> Loading > buildSrc > Compiling /scratch/buildSrc/build.gradle
into local build cache> Loading > buildSrc > Compiling /scratch/buildSrc/build.gradle
into local build cache > Compiling build file '/scratch/buildSrc/build.gradle' to cross
build script cache> Loading > buildSrc > Compiling /scratch/buildSrc/build.gradle
into local build cache> Loading > buildSrc> Loading > buildSrc > Resolving
dependencies ':runtime'> Loading > buildSrc> Loading > buildSrc > :buildSrc:clean:buildSrc:clean
UP-TO-DATE
:buildSrc:compileJava UP-TO-DATE
> Loading > buildSrc > :buildSrc:compileGroovy:buildSrc:compileGroovy
> Loading > buildSrc:buildSrc:processResources UP-TO-DATE
:buildSrc:classes
> Loading > buildSrc > :buildSrc:jar:buildSrc:jar
:buildSrc:assemble
:buildSrc:compileTestJava UP-TO-DATE
:buildSrc:compileTestGroovy UP-TO-DATE
:buildSrc:processTestResources UP-TO-DATE
:buildSrc:testClasses UP-TO-DATE
:buildSrc:test UP-TO-DATE
:buildSrc:check UP-TO-DATE
:buildSrc:build
> Loading > buildSrc> Loading > settings> Configuring > 0/5 projects >
root project > Compiling /scratch/build.gradle into local build cache > Compiling build
file '/scratch/build.gradle' to cross build script cache> Configuring > 0/5 projects
> root project > Compiling /scratch/build.gradle into local build cache> Configuring
> 0/5 projects > root project> Configuring > 0/5 projects > root project >
Resolving dependencies ':classpath'Download https://plugins.gradle.org/m2/com/eriwen/gradle-js-plugin/1.12.1/gradle-js-plugin-1.12.1.pom
> Configuring > 0/5 projects > root project > Resolving dependencies ':classpath'
                                                                                         
          
Download https://plugins.gradle.org/m2/com/github/ben-manes/gradle-versions-plugin/0.11.3/gradle-versions-plugin-0.11.3.pom
> Configuring > 0/5 projects > root project > Resolving dependencies ':classpath'
                                                                                         
                                
Download https://plugins.gradle.org/m2/nl/javadude/gradle/plugins/license-gradle-plugin/0.11.0/license-gradle-plugin-0.11.0.pom
> Configuring > 0/5 projects > root project > Resolving dependencies ':classpath'
                                                                                         
                                    
Download https://plugins.gradle.org/m2/me/champeau/gradle/jmh-gradle-plugin/0.2.0/jmh-gradle-plugin-0.2.0.pom
> Configuring > 0/5 projects > root project > Resolving dependencies ':classpath'
                                                                                         
                  
Download https://plugins.gradle.org/m2/com/google/javascript/closure-compiler/v20131014/closure-compiler-v20131014.pom
> Configuring > 0/5 projects > root project > Resolving dependencies ':classpath'
                                                                                         
                           
Download https://plugins.gradle.org/m2/io/jdev/html2js/html2js/0.1/html2js-0.1.pom
> Configuring > 0/5 projects > root project > Resolving dependencies ':classpath'
                                                                                 
Download https://plugins.gradle.org/m2/com/thoughtworks/xstream/xstream/1.4.7/xstream-1.4.7.pom
> Configuring > 0/5 projects > root project > Resolving dependencies ':classpath'
                                                                                         
    
Download https://plugins.gradle.org/m2/com/thoughtworks/xstream/xstream-parent/1.4.7/xstream-parent-1.4.7.pom
> Configuring > 0/5 projects > root project > Resolving dependencies ':classpath'
                                                                                         
                  
Download https://plugins.gradle.org/m2/org/codehaus/codehaus-parent/3/codehaus-parent-3.pom
> Configuring > 0/5 projects > root project > Resolving dependencies ':classpath'
                                                                                         

Download https://plugins.gradle.org/m2/com/mycila/maven-license-plugin/maven-license-plugin/1.10.b1/maven-license-plugin-1.10.b1.pom
> Configuring > 0/5 projects > root project > Resolving dependencies ':classpath'
                                                                                         
                                         
Download https://plugins.gradle.org/m2/com/mycila/parent-pom/5/parent-pom-5.pom
> Configuring > 0/5 projects > root project > Resolving dependencies ':classpath'
                                                                              
Download https://plugins.gradle.org/m2/com/google/guava/guava/17.0/guava-17.0.pom
> Configuring > 0/5 projects > root project > Resolving dependencies ':classpath'
                                                                                
Download https://plugins.gradle.org/m2/com/google/guava/guava-parent/17.0/guava-parent-17.0.pom
> Configuring > 0/5 projects > root project > Resolving dependencies ':classpath'
                                                                                         
    
Download https://plugins.gradle.org/m2/org/sonatype/oss/oss-parent/7/oss-parent-7.pom
> Configuring > 0/5 projects > root project > Resolving dependencies ':classpath'
                                                                                    
Download https://plugins.gradle.org/m2/args4j/args4j/2.0.16/args4j-2.0.16.pom
> Configuring > 0/5 projects > root project > Resolving dependencies ':classpath'
                                                                            
Download https://plugins.gradle.org/m2/args4j/args4j-site/2.0.16/args4j-site-2.0.16.pom
> Configuring > 0/5 projects > root project > Resolving dependencies ':classpath'
                                                                                      
Download https://plugins.gradle.org/m2/com/google/protobuf/protobuf-java/2.4.1/protobuf-java-2.4.1.pom
> Configuring > 0/5 projects > root project > Resolving dependencies ':classpath'
                                                                                         
           
Download https://plugins.gradle.org/m2/com/google/google/1/google-1.pom
> Configuring > 0/5 projects > root project > Resolving dependencies ':classpath'
                                                                      
Download https://plugins.gradle.org/m2/org/json/json/20090211/json-20090211.pom
> Configuring > 0/5 projects > root project > Resolving dependencies ':classpath'
                                                                              
Download https://plugins.gradle.org/m2/com/google/code/findbugs/jsr305/1.3.9/jsr305-1.3.9.pom
> Configuring > 0/5 projects > root project > Resolving dependencies ':classpath'
                                                                                         
  
Download https://plugins.gradle.org/m2/xmlpull/xmlpull/1.1.3.1/xmlpull-1.1.3.1.pom
> Configuring > 0/5 projects > root project > Resolving dependencies ':classpath'
                                                                                 
Download https://plugins.gradle.org/m2/xpp3/xpp3_min/1.1.4c/xpp3_min-1.1.4c.pom
> Configuring > 0/5 projects > root project > Resolving dependencies ':classpath'
                                                                              
Download https://plugins.gradle.org/m2/org/apache/maven/maven-plugin-api/3.0.1/maven-plugin-api-3.0.1.pom
> Configuring > 0/5 projects > root project > Resolving dependencies ':classpath'
                                                                                         
              
Download https://plugins.gradle.org/m2/org/apache/maven/maven/3.0.1/maven-3.0.1.pom
> Configuring > 0/5 projects > root project > Resolving dependencies ':classpath'
                                                                                  
Download https://plugins.gradle.org/m2/org/apache/maven/maven-parent/15/maven-parent-15.pom
> Configuring > 0/5 projects > root project > Resolving dependencies ':classpath'
                                                                                         

Download https://plugins.gradle.org/m2/org/apache/apache/6/apache-6.pom
> Configuring > 0/5 projects > root project > Resolving dependencies ':classpath'
                                                                      
Download https://plugins.gradle.org/m2/com/mycila/xmltool/xmltool/3.3/xmltool-3.3.pom
> Configuring > 0/5 projects > root project > Resolving dependencies ':classpath'
                                                                                    
Download https://plugins.gradle.org/m2/org/apache/maven/maven-project/3.0-alpha-2/maven-project-3.0-alpha-2.pom
> Configuring > 0/5 projects > root project > Resolving dependencies ':classpath'
                                                                                         
                    
Download https://plugins.gradle.org/m2/org/apache/maven/maven/3.0-alpha-2/maven-3.0-alpha-2.pom
> Configuring > 0/5 projects > root project > Resolving dependencies ':classpath'
                                                                                         
    
Download https://plugins.gradle.org/m2/org/apache/maven/maven-parent/10/maven-parent-10.pom
> Configuring > 0/5 projects > root project > Resolving dependencies ':classpath'
                                                                                         

Download https://plugins.gradle.org/m2/org/apache/apache/4/apache-4.pom
> Configuring > 0/5 projects > root project > Resolving dependencies ':classpath'
                                                                      
Download https://plugins.gradle.org/m2/org/codehaus/plexus/plexus-utils/2.0.5/plexus-utils-2.0.5.pom
> Configuring > 0/5 projects > root project > Resolving dependencies ':classpath'
                                                                                         
         
Download https://plugins.gradle.org/m2/org/codehaus/plexus/plexus/2.0.6/plexus-2.0.6.pom
> Configuring > 0/5 projects > root project > Resolving dependencies ':classpath'
                                                                                       
Download https://plugins.gradle.org/m2/org/apache/maven/maven-model/3.0.1/maven-model-3.0.1.pom
> Configuring > 0/5 projects > root project > Resolving dependencies ':classpath'
                                                                                         
    
Download https://plugins.gradle.org/m2/org/apache/maven/maven-artifact/3.0.1/maven-artifact-3.0.1.pom
> Configuring > 0/5 projects > root project > Resolving dependencies ':classpath'
                                                                                         
          
Download https://plugins.gradle.org/m2/org/sonatype/sisu/sisu-inject-plexus/1.4.3.1/sisu-inject-plexus-1.4.3.1.pom
> Configuring > 0/5 projects > root project > Resolving dependencies ':classpath'
                                                                                         
                       
Download https://plugins.gradle.org/m2/org/sonatype/sisu/inject/guice-plexus/1.4.3.1/guice-plexus-1.4.3.1.pom
> Configuring > 0/5 projects > root project > Resolving dependencies ':classpath'
                                                                                         
                  
Download https://plugins.gradle.org/m2/org/sonatype/sisu/inject/guice-bean/1.4.3.1/guice-bean-1.4.3.1.pom
> Configuring > 0/5 projects > root project > Resolving dependencies ':classpath'
                                                                                         
              
Download https://plugins.gradle.org/m2/org/sonatype/sisu/sisu-inject/1.4.3.1/sisu-inject-1.4.3.1.pom
> Configuring > 0/5 projects > root project > Resolving dependencies ':classpath'
                                                                                         
         
Download https://plugins.gradle.org/m2/org/sonatype/sisu/sisu-parent/1.4.3.1/sisu-parent-1.4.3.1.pom
> Configuring > 0/5 projects > root project > Resolving dependencies ':classpath'
                                                                                         
         
Download https://plugins.gradle.org/m2/org/sonatype/forge/forge-parent/6/forge-parent-6.pom
> Configuring > 0/5 projects > root project > Resolving dependencies ':classpath'
                                                                                         

Download https://plugins.gradle.org/m2/org/codehaus/plexus/plexus-interpolation/1.1/plexus-interpolation-1.1.pom
> Configuring > 0/5 projects > root project > Resolving dependencies ':classpath'
                                                                                         
                     
Download https://plugins.gradle.org/m2/org/codehaus/plexus/plexus/1.0.11/plexus-1.0.11.pom
> Configuring > 0/5 projects > root project > Resolving dependencies ':classpath'
                                                                                         
Download https://plugins.gradle.org/m2/org/apache/maven/maven-compat/3.0-alpha-2/maven-compat-3.0-alpha-2.pom
> Configuring > 0/5 projects > root project > Resolving dependencies ':classpath'
                                                                                         
                  
Download https://plugins.gradle.org/m2/org/codehaus/plexus/plexus-container-default/1.0-beta-3.0.5/plexus-container-default-1.0-beta-3.0.5.pom
> Configuring > 0/5 projects > root project > Resolving dependencies ':classpath'
                                                                                         
                                                   
Download https://plugins.gradle.org/m2/org/codehaus/plexus/plexus-containers/1.0-beta-3.0.5/plexus-containers-1.0-beta-3.0.5.pom
> Configuring > 0/5 projects > root project > Resolving dependencies ':classpath'
                                                                                         
                                     
Download https://plugins.gradle.org/m2/org/codehaus/plexus/plexus/2.0.2/plexus-2.0.2.pom
> Configuring > 0/5 projects > root project > Resolving dependencies ':classpath'
                                                                                       
Download https://plugins.gradle.org/m2/org/codehaus/woodstox/wstx-asl/3.2.6/wstx-asl-3.2.6.pom
> Configuring > 0/5 projects > root project > Resolving dependencies ':classpath'
                                                                                         
   
Download https://plugins.gradle.org/m2/org/sonatype/spice/model-builder/1.3/model-builder-1.3.pom
> Configuring > 0/5 projects > root project > Resolving dependencies ':classpath'
                                                                                         
      
Download https://plugins.gradle.org/m2/org/sonatype/spice/spice-parent/10/spice-parent-10.pom
> Configuring > 0/5 projects > root project > Resolving dependencies ':classpath'
                                                                                         
  
Download https://plugins.gradle.org/m2/org/sonatype/forge/forge-parent/3/forge-parent-3.pom
> Configuring > 0/5 projects > root project > Resolving dependencies ':classpath'
                                                                                         

Download https://plugins.gradle.org/m2/org/apache/maven/maven-project-builder/3.0-alpha-2/maven-project-builder-3.0-alpha-2.pom
> Configuring > 0/5 projects > root project > Resolving dependencies ':classpath'
                                                                                         
                                    
Download https://plugins.gradle.org/m2/org/codehaus/plexus/plexus-component-annotations/1.5.5/plexus-component-annotations-1.5.5.pom
> Configuring > 0/5 projects > root project > Resolving dependencies ':classpath'
                                                                                         
                                         
Download https://plugins.gradle.org/m2/org/codehaus/plexus/plexus-containers/1.5.5/plexus-containers-1.5.5.pom
> Configuring > 0/5 projects > root project > Resolving dependencies ':classpath'
                                                                                         
                   
Download https://plugins.gradle.org/m2/org/codehaus/plexus/plexus/2.0.7/plexus-2.0.7.pom
> Configuring > 0/5 projects > root project > Resolving dependencies ':classpath'
                                                                                       
Download https://plugins.gradle.org/m2/org/codehaus/plexus/plexus-classworlds/2.2.3/plexus-classworlds-2.2.3.pom
> Configuring > 0/5 projects > root project > Resolving dependencies ':classpath'
                                                                                         
                     
Download https://plugins.gradle.org/m2/org/sonatype/sisu/sisu-inject-bean/1.4.3.1/sisu-inject-bean-1.4.3.1.pom
> Configuring > 0/5 projects > root project > Resolving dependencies ':classpath'
                                                                                         
                   
Download https://plugins.gradle.org/m2/org/apache/maven/wagon/wagon-provider-api/1.0-beta-4/wagon-provider-api-1.0-beta-4.pom
> Configuring > 0/5 projects > root project > Resolving dependencies ':classpath'
                                                                                         
                                  
Download https://plugins.gradle.org/m2/org/apache/maven/wagon/wagon/1.0-beta-4/wagon-1.0-beta-4.pom
> Configuring > 0/5 projects > root project > Resolving dependencies ':classpath'
                                                                                         
        
Download https://plugins.gradle.org/m2/org/apache/maven/maven-parent/8/maven-parent-8.pom
> Configuring > 0/5 projects > root project > Resolving dependencies ':classpath'
                                                                                        
Download https://plugins.gradle.org/m2/org/apache/xbean/xbean-reflect/3.4/xbean-reflect-3.4.pom
> Configuring > 0/5 projects > root project > Resolving dependencies ':classpath'
                                                                                         
    
Download https://plugins.gradle.org/m2/org/apache/xbean/xbean/3.4/xbean-3.4.pom
> Configuring > 0/5 projects > root project > Resolving dependencies ':classpath'
                                                                              
Download https://plugins.gradle.org/m2/com/google/code/google-collections/google-collect/snapshot-20080530/google-collect-snapshot-20080530.pom
> Configuring > 0/5 projects > root project > Resolving dependencies ':classpath'
                                                                                         
                                                    
Download https://plugins.gradle.org/m2/stax/stax-api/1.0.1/stax-api-1.0.1.pom
> Configuring > 0/5 projects > root project > Resolving dependencies ':classpath'
                                                                            
Download https://plugins.gradle.org/m2/org/sonatype/sisu/sisu-guice/2.9.1/sisu-guice-2.9.1.pom
> Configuring > 0/5 projects > root project > Resolving dependencies ':classpath'
                                                                                         
   
Download https://plugins.gradle.org/m2/org/sonatype/sisu/inject/guice-parent/2.9.1/guice-parent-2.9.1.pom
> Configuring > 0/5 projects > root project > Resolving dependencies ':classpath'
                                                                                         
              
Download https://plugins.gradle.org/m2/log4j/log4j/1.2.12/log4j-1.2.12.pom
> Configuring > 0/5 projects > root project > Resolving dependencies ':classpath'
                                                                         
Download https://plugins.gradle.org/m2/commons-logging/commons-logging-api/1.1/commons-logging-api-1.1.pom
> Configuring > 0/5 projects > root project > Resolving dependencies ':classpath'
                                                                                         
               
> Configuring > 0/5 projects > root projectDownload https://plugins.gradle.org/m2/com/eriwen/gradle-js-plugin/1.12.1/gradle-js-plugin-1.12.1.jar
> Configuring > 0/5 projects > root project> Configuring > 0/5 projects >
root project > 294 KB/839 KB downloaded> Configuring > 0/5 projects > root project
> 622 KB/839 KB downloaded                                                            
                                        
> Configuring > 0/5 projects > root projectDownload https://plugins.gradle.org/m2/com/github/ben-manes/gradle-versions-plugin/0.11.3/gradle-versions-plugin-0.11.3.jar
> Configuring > 0/5 projects > root project                                     
                                                                                     
Download https://plugins.gradle.org/m2/nl/javadude/gradle/plugins/license-gradle-plugin/0.11.0/license-gradle-plugin-0.11.0.jar
> Configuring > 0/5 projects > root project                                     
                                                                                         
Download https://plugins.gradle.org/m2/me/champeau/gradle/jmh-gradle-plugin/0.2.0/jmh-gradle-plugin-0.2.0.jar
> Configuring > 0/5 projects > root project                                     
                                                                       
Download https://plugins.gradle.org/m2/com/google/javascript/closure-compiler/v20131014/closure-compiler-v20131014.jar
> Configuring > 0/5 projects > root project                                     
                                                                                

FAILURE: Build failed with an exception.

* What went wrong:
A problem occurred configuring root project 'aurora'.
> Could not resolve all dependencies for configuration ':classpath'.
   > Could not download closure-compiler.jar (com.google.javascript:closure-compiler:v20131014)
      > Could not get resource 'https://plugins.gradle.org/m2/com/google/javascript/closure-compiler/v20131014/closure-compiler-v20131014.jar'.
         > Tag mismatch!

* Try:
Run with --stacktrace option to get the stack trace. Run with --info or --debug option to
get more log output.

BUILD FAILED

Total time: 1 mins 16.781 secs
debian/rules:32: recipe for target '__gradle_build' failed
make[1]: *** [__gradle_build] Error 1
make[1]: Leaving directory '/scratch'
debian/rules:22: recipe for target 'build' failed
make: *** [build] Error 2
dpkg-buildpackage: error: debian/rules build gave error exit status 2
Build step 'Execute shell' marked build as failure
Skipped archiving because build is not successful

Mime
View raw message