aurora-dev mailing list archives

Site index · List index
Message view « Date » · « Thread »
Top « Date » · « Thread »
From Apache Jenkins Server <jenk...@builds.apache.org>
Subject Build failed in Jenkins: aurora-packaging-nightly #592
Date Thu, 02 Mar 2017 00:49:19 GMT
See <https://builds.apache.org/job/aurora-packaging-nightly/592/display/redirect>

------------------------------------------
[...truncated 1.89 MB...]
 ---> 0ef2e08ed3fa
Step 2/9 : WORKDIR /aurora
 ---> Using cache
 ---> a66872221388
Step 3/9 : ENV HOME /aurora
 ---> Using cache
 ---> 6fb480d6e24e
Step 4/9 : ENV DEBIAN_FRONTEND noninteractive
 ---> Using cache
 ---> efa268ddf669
Step 5/9 : RUN apt-get update && apt-get -y install   bison   debhelper   devscripts
  dh-systemd   dpkg-dev   curl   git   gcc-4.8   libapr1-dev   libcurl4-openssl-dev   libsvn-dev
  libffi-dev   python-all-dev   software-properties-common   libkrb5-dev
 ---> Using cache
 ---> 6d5b746f2fba
Step 6/9 : RUN apt-get -y install openjdk-8-jdk   && update-alternatives --set java
/usr/lib/jvm/java-8-openjdk-amd64/jre/bin/java
 ---> Using cache
 ---> 1c6cab7d65ac
Step 7/9 : RUN curl -sSL http://apache.org/dist/thrift/KEYS | gpg --import - &&  
 gpg --export --armor 66B778F9 | apt-key add - &&    echo 'deb http://www.apache.org/dist/thrift/debian
0.9.1 main' > /etc/apt/sources.list.d/thrift.list &&    apt-get update &&
   apt-get -y install thrift-compiler=0.9.1
 ---> Using cache
 ---> 71767b2b9fab
Step 8/9 : RUN git clone --depth 1 https://github.com/benley/gradle-packaging   &&
cd gradle-packaging   && apt-get -y install ruby ruby-dev unzip wget   &&
gem install fpm && ./gradle-mkdeb.sh 3.1   && apt-get -y install gdebi-core
  && gdebi --non-interactive gradle-3.1_3.1-2_all.deb   && cd .. &&
rm -rf gradle-packaging
 ---> Using cache
 ---> 739b72afee83
Step 9/9 : ADD build.sh /build.sh
 ---> Using cache
 ---> e280adff3dc9
Successfully built e280adff3dc9
+ mkdir /scratch
+ cd /scratch
+ tar --strip-components 1 -C . -xf /src.tar.gz
+ cp -R /specs/debian .
+ rm ./debian/aurora-executor.thermos.upstart ./debian/aurora-scheduler.upstart ./debian/aurora-executor.thermos.init
./debian/aurora-scheduler.init
++ lsb_release -is
++ tr '[:upper:]' '[:lower:]'
+ DISTRO=ubuntu
++ lsb_release -cs
++ tr '[:upper:]' '[:lower:]'
+ CODENAME=xenial
+ THIRD_PARTY_REPO=https://svn.apache.org/repos/asf/aurora/3rdparty/
+ THIRD_PARTY_REPO+=ubuntu/xenial64/python/
+ echo '[python-repos]'
+ echo 'repos: ['\''third_party/'\'', '\''https://svn.apache.org/repos/asf/aurora/3rdparty/ubuntu/xenial64/python/'\'']'
+ export 'DEBFULLNAME=Apache Aurora'
+ DEBFULLNAME='Apache Aurora'
+ export DEBEMAIL=dev@aurora.apache.org
+ DEBEMAIL=dev@aurora.apache.org
++ date -R
+ dch --newversion 0.18.0-SNAPSHOT.2017.03.02 --package apache-aurora --urgency medium 'Apache
Aurora package builder <dev@aurora.apache.org> Thu, 02 Mar 2017 00:47:26 +0000'
dch warning: Previous package version was Debian native whilst new version is not
+ dch --release ''
+ dpkg-buildpackage -uc -b -tc
dpkg-buildpackage: source package apache-aurora
dpkg-buildpackage: source version 0.18.0-SNAPSHOT.2017.03.02
dpkg-buildpackage: source distribution xenial
dpkg-buildpackage: source changed by Apache Aurora <dev@aurora.apache.org>
dpkg-buildpackage: host architecture amd64
 dpkg-source --before-build scratch
 debian/rules clean
dh clean --exclude=aurora-scheduler.bat --with=systemd
   dh_testdir -O--exclude=aurora-scheduler.bat
   dh_auto_clean -O--exclude=aurora-scheduler.bat
   dh_clean -O--exclude=aurora-scheduler.bat
 debian/rules build
dh build --exclude=aurora-scheduler.bat --with=systemd
   dh_testdir -O--exclude=aurora-scheduler.bat
   dh_update_autotools_config -O--exclude=aurora-scheduler.bat
   dh_auto_configure -O--exclude=aurora-scheduler.bat
   debian/rules override_dh_auto_build
make[1]: Entering directory '/scratch'
/usr/bin/gradle installDist
Starting a Gradle Daemon (subsequent builds will be faster)
> Starting Daemon> Starting Daemon > Connecting to Daemon> LoadingInvalidating
buildSrc state cache (/scratch/buildSrc/.gradle/noVersion/buildSrc) as it was not closed cleanly.
> Loading > buildSrc > settings> Loading > buildSrc> Loading > buildSrc
> Compiling jar:file:/opt/gradle-3.1/lib/gradle-core-3.1.jar!/org/gradle/initialization/buildsrc/defaultBuildSourceScript.txt
into local build cache> Loading > buildSrc > Compiling jar:file:/opt/gradle-3.1/lib/gradle-core-3.1.jar!/org/gradle/initialization/buildsrc/defaultBuildSourceScript.txt
into local build cache > Compiling script 'jar:file:/opt/gradle-3.1/lib/gradle-core-3.1.jar!/org/gradle/initialization/buildsrc/defaultBuildSourceScript.txt'
to cross build script cache> Loading > buildSrcGenerating JAR file 'gradle-api-3.1.jar'
> Loading > buildSrc> Loading > buildSrc > Generating 0%> Loading > buildSrc
> Generating 1%> Loading > buildSrc > Generating 2%> Loading > buildSrc
> Generating 3%> Loading > buildSrc > Generating 4%> Loading > buildSrc
> Generating 9%> Loading > buildSrc > Generating 20%> Loading > buildSrc
> Generating 25%> Loading > buildSrc > Generating 26%> Loading > buildSrc
> Generating 27%> Loading > buildSrc > Generating 29%> Loading > buildSrc
> Generating 36%> Loading > buildSrc > Generating 40%> Loading > buildSrc
> Generating 45%> Loading > buildSrc > Generating 47%> Loading > buildSrc
> Generating 49%> Loading > buildSrc > Generating 50%> Loading > buildSrc
> Generating 51%> Loading > buildSrc > Generating 52%> Loading > buildSrc
> Generating 55%> Loading > buildSrc > Generating 58%> Loading > buildSrc
> Generating 62%> Loading > buildSrc > Generating 63%> Loading > buildSrc
> Generating 64%> Loading > buildSrc > Generating 67%> Loading > buildSrc
> Generating 69%> Loading > buildSrc > Generating 70%> Loading > buildSrc
> Generating 75%> Loading > buildSrc > Generating 76%> Loading > buildSrc
> Generating 77%> Loading > buildSrc > Generating 79%> Loading > buildSrc
> Generating 84%> Loading > buildSrc > Generating 85%> Loading > buildSrc
> Generating 87%> Loading > buildSrc > Generating 88%> Loading > buildSrc
> Generating 92%> Loading > buildSrc > Generating 94%> Loading > buildSrc
> Generating 96%> Loading > buildSrc > Generating 100%                       
                
> Loading > buildSrc> Loading > buildSrc > Compiling /scratch/buildSrc/build.gradle
into local build cache> Loading > buildSrc > Compiling /scratch/buildSrc/build.gradle
into local build cache > Compiling build file '/scratch/buildSrc/build.gradle' to cross
build script cache> Loading > buildSrc > Compiling /scratch/buildSrc/build.gradle
into local build cache> Loading > buildSrc > Resolving dependencies ':runtime'>
Loading > buildSrc:buildSrc:clean UP-TO-DATE
:buildSrc:compileJava UP-TO-DATE
> Loading > buildSrc > :buildSrc:compileGroovy:buildSrc:compileGroovy
> Loading > buildSrc:buildSrc:processResources UP-TO-DATE
:buildSrc:classes
:buildSrc:jar
:buildSrc:assemble
:buildSrc:compileTestJava UP-TO-DATE
:buildSrc:compileTestGroovy UP-TO-DATE
:buildSrc:processTestResources UP-TO-DATE
:buildSrc:testClasses UP-TO-DATE
:buildSrc:test UP-TO-DATE
:buildSrc:check UP-TO-DATE
:buildSrc:build
> Loading > buildSrc> Configuring> Configuring > 0/5 projects > root project
> Compiling /scratch/build.gradle into local build cache > Compiling build file '/scratch/build.gradle'
to cross build script cache> Configuring > 0/5 projects > root project > Compiling
/scratch/build.gradle into local build cache> Configuring > 0/5 projects > root project>
Configuring > 0/5 projects > root project > Resolving dependencies ':classpath'Download
https://plugins.gradle.org/m2/com/eriwen/gradle-js-plugin/1.12.1/gradle-js-plugin-1.12.1.pom
> Configuring > 0/5 projects > root project > Resolving dependencies ':classpath'
                                                                                         
          
Download https://plugins.gradle.org/m2/com/github/ben-manes/gradle-versions-plugin/0.11.3/gradle-versions-plugin-0.11.3.pom
> Configuring > 0/5 projects > root project > Resolving dependencies ':classpath'
                                                                                         
                                
Download https://plugins.gradle.org/m2/nl/javadude/gradle/plugins/license-gradle-plugin/0.11.0/license-gradle-plugin-0.11.0.pom
> Configuring > 0/5 projects > root project > Resolving dependencies ':classpath'
                                                                                         
                                    
Download https://plugins.gradle.org/m2/me/champeau/gradle/jmh-gradle-plugin/0.2.0/jmh-gradle-plugin-0.2.0.pom
> Configuring > 0/5 projects > root project > Resolving dependencies ':classpath'
                                                                                         
                  
Download https://plugins.gradle.org/m2/com/google/javascript/closure-compiler/v20131014/closure-compiler-v20131014.pom
> Configuring > 0/5 projects > root project > Resolving dependencies ':classpath'
                                                                                         
                           
Download https://plugins.gradle.org/m2/io/jdev/html2js/html2js/0.1/html2js-0.1.pom
> Configuring > 0/5 projects > root project > Resolving dependencies ':classpath'
                                                                                 
Download https://plugins.gradle.org/m2/com/thoughtworks/xstream/xstream/1.4.7/xstream-1.4.7.pom
> Configuring > 0/5 projects > root project > Resolving dependencies ':classpath'
                                                                                         
    
Download https://plugins.gradle.org/m2/com/thoughtworks/xstream/xstream-parent/1.4.7/xstream-parent-1.4.7.pom
> Configuring > 0/5 projects > root project > Resolving dependencies ':classpath'
                                                                                         
                  
Download https://plugins.gradle.org/m2/org/codehaus/codehaus-parent/3/codehaus-parent-3.pom
> Configuring > 0/5 projects > root project > Resolving dependencies ':classpath'
                                                                                         

Download https://plugins.gradle.org/m2/com/mycila/maven-license-plugin/maven-license-plugin/1.10.b1/maven-license-plugin-1.10.b1.pom
> Configuring > 0/5 projects > root project > Resolving dependencies ':classpath'
                                                                                         
                                         
Download https://plugins.gradle.org/m2/com/mycila/parent-pom/5/parent-pom-5.pom
> Configuring > 0/5 projects > root project > Resolving dependencies ':classpath'
                                                                              
Download https://plugins.gradle.org/m2/com/google/guava/guava/17.0/guava-17.0.pom
> Configuring > 0/5 projects > root project > Resolving dependencies ':classpath'
                                                                                
Download https://plugins.gradle.org/m2/com/google/guava/guava-parent/17.0/guava-parent-17.0.pom
> Configuring > 0/5 projects > root project > Resolving dependencies ':classpath'
                                                                                         
    
Download https://plugins.gradle.org/m2/org/sonatype/oss/oss-parent/7/oss-parent-7.pom
> Configuring > 0/5 projects > root project > Resolving dependencies ':classpath'
                                                                                    
Download https://plugins.gradle.org/m2/args4j/args4j/2.0.16/args4j-2.0.16.pom
> Configuring > 0/5 projects > root project > Resolving dependencies ':classpath'
                                                                            
Download https://plugins.gradle.org/m2/args4j/args4j-site/2.0.16/args4j-site-2.0.16.pom
> Configuring > 0/5 projects > root project > Resolving dependencies ':classpath'
                                                                                      
Download https://plugins.gradle.org/m2/com/google/protobuf/protobuf-java/2.4.1/protobuf-java-2.4.1.pom
> Configuring > 0/5 projects > root project > Resolving dependencies ':classpath'
                                                                                         
           
Download https://plugins.gradle.org/m2/com/google/google/1/google-1.pom
> Configuring > 0/5 projects > root project > Resolving dependencies ':classpath'
                                                                      
Download https://plugins.gradle.org/m2/org/json/json/20090211/json-20090211.pom
> Configuring > 0/5 projects > root project > Resolving dependencies ':classpath'
                                                                              
Download https://plugins.gradle.org/m2/com/google/code/findbugs/jsr305/1.3.9/jsr305-1.3.9.pom
> Configuring > 0/5 projects > root project > Resolving dependencies ':classpath'
                                                                                         
  
Download https://plugins.gradle.org/m2/xmlpull/xmlpull/1.1.3.1/xmlpull-1.1.3.1.pom
> Configuring > 0/5 projects > root project > Resolving dependencies ':classpath'
                                                                                 
Download https://plugins.gradle.org/m2/xpp3/xpp3_min/1.1.4c/xpp3_min-1.1.4c.pom
> Configuring > 0/5 projects > root project > Resolving dependencies ':classpath'
                                                                              
Download https://plugins.gradle.org/m2/org/apache/maven/maven-plugin-api/3.0.1/maven-plugin-api-3.0.1.pom
> Configuring > 0/5 projects > root project > Resolving dependencies ':classpath'
                                                                                         
              
Download https://plugins.gradle.org/m2/org/apache/maven/maven/3.0.1/maven-3.0.1.pom
> Configuring > 0/5 projects > root project > Resolving dependencies ':classpath'
                                                                                  
Download https://plugins.gradle.org/m2/org/apache/maven/maven-parent/15/maven-parent-15.pom
> Configuring > 0/5 projects > root project > Resolving dependencies ':classpath'
                                                                                         

Download https://plugins.gradle.org/m2/org/apache/apache/6/apache-6.pom
> Configuring > 0/5 projects > root project > Resolving dependencies ':classpath'
                                                                      
Download https://plugins.gradle.org/m2/com/mycila/xmltool/xmltool/3.3/xmltool-3.3.pom
> Configuring > 0/5 projects > root project > Resolving dependencies ':classpath'
                                                                                    
Download https://plugins.gradle.org/m2/org/apache/maven/maven-project/3.0-alpha-2/maven-project-3.0-alpha-2.pom
> Configuring > 0/5 projects > root project > Resolving dependencies ':classpath'
                                                                                         
                    
Download https://plugins.gradle.org/m2/org/apache/maven/maven/3.0-alpha-2/maven-3.0-alpha-2.pom
> Configuring > 0/5 projects > root project > Resolving dependencies ':classpath'
                                                                                         
    
Download https://plugins.gradle.org/m2/org/apache/maven/maven-parent/10/maven-parent-10.pom
> Configuring > 0/5 projects > root project > Resolving dependencies ':classpath'
                                                                                         

Download https://plugins.gradle.org/m2/org/apache/apache/4/apache-4.pom
> Configuring > 0/5 projects > root project > Resolving dependencies ':classpath'
                                                                      
Download https://plugins.gradle.org/m2/org/codehaus/plexus/plexus-utils/2.0.5/plexus-utils-2.0.5.pom
> Configuring > 0/5 projects > root project > Resolving dependencies ':classpath'
                                                                                         
         
Download https://plugins.gradle.org/m2/org/codehaus/plexus/plexus/2.0.6/plexus-2.0.6.pom
> Configuring > 0/5 projects > root project > Resolving dependencies ':classpath'
                                                                                       
Download https://plugins.gradle.org/m2/org/apache/maven/maven-model/3.0.1/maven-model-3.0.1.pom
> Configuring > 0/5 projects > root project > Resolving dependencies ':classpath'
                                                                                         
    
Download https://plugins.gradle.org/m2/org/apache/maven/maven-artifact/3.0.1/maven-artifact-3.0.1.pom
> Configuring > 0/5 projects > root project > Resolving dependencies ':classpath'
                                                                                         
          
Download https://plugins.gradle.org/m2/org/sonatype/sisu/sisu-inject-plexus/1.4.3.1/sisu-inject-plexus-1.4.3.1.pom
> Configuring > 0/5 projects > root project > Resolving dependencies ':classpath'
                                                                                         
                       
Download https://plugins.gradle.org/m2/org/sonatype/sisu/inject/guice-plexus/1.4.3.1/guice-plexus-1.4.3.1.pom
> Configuring > 0/5 projects > root project > Resolving dependencies ':classpath'
                                                                                         
                  
Download https://plugins.gradle.org/m2/org/sonatype/sisu/inject/guice-bean/1.4.3.1/guice-bean-1.4.3.1.pom
> Configuring > 0/5 projects > root project > Resolving dependencies ':classpath'
                                                                                         
              
Download https://plugins.gradle.org/m2/org/sonatype/sisu/sisu-inject/1.4.3.1/sisu-inject-1.4.3.1.pom
> Configuring > 0/5 projects > root project > Resolving dependencies ':classpath'
                                                                                         
         
Download https://plugins.gradle.org/m2/org/sonatype/sisu/sisu-parent/1.4.3.1/sisu-parent-1.4.3.1.pom
> Configuring > 0/5 projects > root project > Resolving dependencies ':classpath'
                                                                                         
         
Download https://plugins.gradle.org/m2/org/sonatype/forge/forge-parent/6/forge-parent-6.pom
> Configuring > 0/5 projects > root project > Resolving dependencies ':classpath'
                                                                                         

Download https://plugins.gradle.org/m2/org/codehaus/plexus/plexus-interpolation/1.1/plexus-interpolation-1.1.pom
> Configuring > 0/5 projects > root project > Resolving dependencies ':classpath'
                                                                                         
                     
Download https://plugins.gradle.org/m2/org/codehaus/plexus/plexus/1.0.11/plexus-1.0.11.pom
> Configuring > 0/5 projects > root project > Resolving dependencies ':classpath'
                                                                                         
Download https://plugins.gradle.org/m2/org/apache/maven/maven-compat/3.0-alpha-2/maven-compat-3.0-alpha-2.pom
> Configuring > 0/5 projects > root project > Resolving dependencies ':classpath'
                                                                                         
                  
Download https://plugins.gradle.org/m2/org/codehaus/plexus/plexus-container-default/1.0-beta-3.0.5/plexus-container-default-1.0-beta-3.0.5.pom
> Configuring > 0/5 projects > root project > Resolving dependencies ':classpath'
                                                                                         
                                                   
Download https://plugins.gradle.org/m2/org/codehaus/plexus/plexus-containers/1.0-beta-3.0.5/plexus-containers-1.0-beta-3.0.5.pom
> Configuring > 0/5 projects > root project > Resolving dependencies ':classpath'
                                                                                         
                                     
Download https://plugins.gradle.org/m2/org/codehaus/plexus/plexus/2.0.2/plexus-2.0.2.pom
> Configuring > 0/5 projects > root project > Resolving dependencies ':classpath'
                                                                                       
Download https://plugins.gradle.org/m2/org/sonatype/spice/model-builder/1.3/model-builder-1.3.pom
> Configuring > 0/5 projects > root project > Resolving dependencies ':classpath'
                                                                                         
      
Download https://plugins.gradle.org/m2/org/sonatype/spice/spice-parent/10/spice-parent-10.pom
> Configuring > 0/5 projects > root project > Resolving dependencies ':classpath'
                                                                                         
  
Download https://plugins.gradle.org/m2/org/sonatype/forge/forge-parent/3/forge-parent-3.pom
> Configuring > 0/5 projects > root project > Resolving dependencies ':classpath'
                                                                                         

Download https://plugins.gradle.org/m2/org/apache/maven/maven-project-builder/3.0-alpha-2/maven-project-builder-3.0-alpha-2.pom
> Configuring > 0/5 projects > root project > Resolving dependencies ':classpath'
                                                                                         
                                    
Download https://plugins.gradle.org/m2/org/codehaus/plexus/plexus-component-annotations/1.5.5/plexus-component-annotations-1.5.5.pom
> Configuring > 0/5 projects > root project > Resolving dependencies ':classpath'
                                                                                         
                                         
Download https://plugins.gradle.org/m2/org/codehaus/plexus/plexus-containers/1.5.5/plexus-containers-1.5.5.pom
> Configuring > 0/5 projects > root project > Resolving dependencies ':classpath'
                                                                                         
                   
Download https://plugins.gradle.org/m2/org/codehaus/plexus/plexus/2.0.7/plexus-2.0.7.pom
> Configuring > 0/5 projects > root project > Resolving dependencies ':classpath'
                                                                                       
Download https://plugins.gradle.org/m2/org/codehaus/plexus/plexus-classworlds/2.2.3/plexus-classworlds-2.2.3.pom
> Configuring > 0/5 projects > root project > Resolving dependencies ':classpath'
                                                                                         
                     
Download https://plugins.gradle.org/m2/org/sonatype/sisu/sisu-inject-bean/1.4.3.1/sisu-inject-bean-1.4.3.1.pom
> Configuring > 0/5 projects > root project > Resolving dependencies ':classpath'
                                                                                         
                   
Download https://plugins.gradle.org/m2/org/apache/maven/wagon/wagon-provider-api/1.0-beta-4/wagon-provider-api-1.0-beta-4.pom
> Configuring > 0/5 projects > root project > Resolving dependencies ':classpath'
                                                                                         
                                  
Download https://plugins.gradle.org/m2/org/apache/maven/wagon/wagon/1.0-beta-4/wagon-1.0-beta-4.pom
> Configuring > 0/5 projects > root project > Resolving dependencies ':classpath'
                                                                                         
        
Download https://plugins.gradle.org/m2/org/apache/maven/maven-parent/8/maven-parent-8.pom
> Configuring > 0/5 projects > root project > Resolving dependencies ':classpath'
                                                                                        
Download https://plugins.gradle.org/m2/org/apache/xbean/xbean-reflect/3.4/xbean-reflect-3.4.pom
> Configuring > 0/5 projects > root project > Resolving dependencies ':classpath'
                                                                                         
    
Download https://plugins.gradle.org/m2/org/apache/xbean/xbean/3.4/xbean-3.4.pom
> Configuring > 0/5 projects > root project > Resolving dependencies ':classpath'
                                                                              
Download https://plugins.gradle.org/m2/com/google/code/google-collections/google-collect/snapshot-20080530/google-collect-snapshot-20080530.pom
> Configuring > 0/5 projects > root project > Resolving dependencies ':classpath'
                                                                                         
                                                    
Download https://plugins.gradle.org/m2/stax/stax-api/1.0.1/stax-api-1.0.1.pom
> Configuring > 0/5 projects > root project > Resolving dependencies ':classpath'
                                                                            
Download https://plugins.gradle.org/m2/org/sonatype/sisu/sisu-guice/2.9.1/sisu-guice-2.9.1.pom
> Configuring > 0/5 projects > root project > Resolving dependencies ':classpath'
                                                                                         
   
Download https://plugins.gradle.org/m2/org/sonatype/sisu/inject/guice-parent/2.9.1/guice-parent-2.9.1.pom
> Configuring > 0/5 projects > root project > Resolving dependencies ':classpath'
                                                                                         
              
Download https://plugins.gradle.org/m2/log4j/log4j/1.2.12/log4j-1.2.12.pom
> Configuring > 0/5 projects > root project > Resolving dependencies ':classpath'
                                                                         
Download https://plugins.gradle.org/m2/commons-logging/commons-logging-api/1.1/commons-logging-api-1.1.pom
> Configuring > 0/5 projects > root project > Resolving dependencies ':classpath'
                                                                                         
               

FAILURE: Build failed with an exception.

* What went wrong:
A problem occurred configuring root project 'aurora'.
> Could not resolve all dependencies for configuration ':classpath'.
   > Could not resolve org.codehaus.woodstox:wstx-asl:3.2.6.
     Required by:
         project : > nl.javadude.gradle.plugins:license-gradle-plugin:0.11.0 > com.mycila.maven-license-plugin:maven-license-plugin:1.10.b1
> org.apache.maven:maven-project:3.0-alpha-2
         project : > nl.javadude.gradle.plugins:license-gradle-plugin:0.11.0 > com.mycila.maven-license-plugin:maven-license-plugin:1.10.b1
> org.apache.maven:maven-project:3.0-alpha-2 > org.sonatype.spice:model-builder:1.3
      > Could not resolve org.codehaus.woodstox:wstx-asl:3.2.6.
         > Could not get resource 'https://plugins.gradle.org/m2/org/codehaus/woodstox/wstx-asl/3.2.6/wstx-asl-3.2.6.pom'.
            > Could not GET 'https://plugins.gradle.org/m2/org/codehaus/woodstox/wstx-asl/3.2.6/wstx-asl-3.2.6.pom'.
Received status code 520 from server: Origin Error

* Try:
Run with --stacktrace option to get the stack trace. Run with --info or --debug option to
get more log output.

BUILD FAILED

Total time: 1 mins 50.182 secs
debian/rules:32: recipe for target '__gradle_build' failed
make[1]: *** [__gradle_build] Error 1
make[1]: Leaving directory '/scratch'
debian/rules:22: recipe for target 'build' failed
make: *** [build] Error 2
dpkg-buildpackage: error: debian/rules build gave error exit status 2
Build step 'Execute shell' marked build as failure
Skipped archiving because build is not successful

Mime
View raw message