aurora-dev mailing list archives

Site index · List index
Message view « Date » · « Thread »
Top « Date » · « Thread »
From Apache Jenkins Server <jenk...@builds.apache.org>
Subject Build failed in Jenkins: aurora-packaging-nightly #568
Date Mon, 06 Feb 2017 00:38:32 GMT
See <https://builds.apache.org/job/aurora-packaging-nightly/568/>

------------------------------------------
[...truncated 30848 lines...]
stdout

artifacts/aurora-centos-7/dist/rpmbuild/BUILD/apache-aurora-0.18.0-SNAPSHOT/src/test/resources/org/apache/thermos/root/logs/ordering/echo_three:
0

artifacts/aurora-centos-7/dist/rpmbuild/BUILD/apache-aurora-0.18.0-SNAPSHOT/src/test/resources/org/apache/thermos/root/logs/ordering/echo_three/0:
stdout

artifacts/aurora-centos-7/dist/rpmbuild/BUILD/apache-aurora-0.18.0-SNAPSHOT/src/test/resources/org/apache/thermos/root/logs/ordering/echo_two:
0

artifacts/aurora-centos-7/dist/rpmbuild/BUILD/apache-aurora-0.18.0-SNAPSHOT/src/test/resources/org/apache/thermos/root/logs/ordering/echo_two/0:
stdout

artifacts/aurora-centos-7/dist/rpmbuild/BUILD/apache-aurora-0.18.0-SNAPSHOT/src/test/resources/org/apache/thermos/root/logs/ports:
echo

artifacts/aurora-centos-7/dist/rpmbuild/BUILD/apache-aurora-0.18.0-SNAPSHOT/src/test/resources/org/apache/thermos/root/logs/ports/echo:
0

artifacts/aurora-centos-7/dist/rpmbuild/BUILD/apache-aurora-0.18.0-SNAPSHOT/src/test/resources/org/apache/thermos/root/logs/ports/echo/0:
stdout

artifacts/aurora-centos-7/dist/rpmbuild/BUILD/apache-aurora-0.18.0-SNAPSHOT/src/test/resources/org/apache/thermos/root/sandbox:
p1
p2
p3

artifacts/aurora-centos-7/dist/rpmbuild/BUILD/apache-aurora-0.18.0-SNAPSHOT/src/test/resources/org/apache/thermos/root/tasks:
active
finished

artifacts/aurora-centos-7/dist/rpmbuild/BUILD/apache-aurora-0.18.0-SNAPSHOT/src/test/resources/org/apache/thermos/root/tasks/active:
sleep60-lost

artifacts/aurora-centos-7/dist/rpmbuild/BUILD/apache-aurora-0.18.0-SNAPSHOT/src/test/resources/org/apache/thermos/root/tasks/finished:
failure
failure_limit
hello_world
ordering
ports
sleep60

artifacts/aurora-centos-7/dist/rpmbuild/BUILD/apache-aurora-0.18.0-SNAPSHOT/src/test/sh:
org

artifacts/aurora-centos-7/dist/rpmbuild/BUILD/apache-aurora-0.18.0-SNAPSHOT/src/test/sh/org:
apache

artifacts/aurora-centos-7/dist/rpmbuild/BUILD/apache-aurora-0.18.0-SNAPSHOT/src/test/sh/org/apache:
aurora

artifacts/aurora-centos-7/dist/rpmbuild/BUILD/apache-aurora-0.18.0-SNAPSHOT/src/test/sh/org/apache/aurora:
e2e

artifacts/aurora-centos-7/dist/rpmbuild/BUILD/apache-aurora-0.18.0-SNAPSHOT/src/test/sh/org/apache/aurora/e2e:
Dockerfile.netcat
Dockerfile.python
ephemeral_daemon_with_final.aurora
http
http_example.py
run-server.sh
test_bypass_leader_redirect_end_to_end.sh
test_daemonizing_process.aurora
test_end_to_end.sh
test_kerberos_end_to_end.sh
validate_serverset.py

artifacts/aurora-centos-7/dist/rpmbuild/BUILD/apache-aurora-0.18.0-SNAPSHOT/src/test/sh/org/apache/aurora/e2e/http:
http_example.aurora
http_example_bad_healthcheck.aurora
http_example_updated.aurora

artifacts/aurora-centos-7/dist/rpmbuild/BUILDROOT:

artifacts/aurora-centos-7/dist/rpmbuild/RPMS:
x86_64

artifacts/aurora-centos-7/dist/rpmbuild/RPMS/x86_64:
aurora-executor-0.17.0_SNAPSHOT.2017.01.23-1.el7.centos.aurora.x86_64.rpm
aurora-executor-0.18.0_SNAPSHOT.2017.02.03-1.el7.centos.aurora.x86_64.rpm
aurora-executor-0.18.0_SNAPSHOT.2017.02.05-1.el7.centos.aurora.x86_64.rpm
aurora-executor-0.18.0_SNAPSHOT.2017.02.06-1.el7.centos.aurora.x86_64.rpm
aurora-scheduler-0.17.0_SNAPSHOT.2017.01.23-1.el7.centos.aurora.x86_64.rpm
aurora-scheduler-0.18.0_SNAPSHOT.2017.02.03-1.el7.centos.aurora.x86_64.rpm
aurora-scheduler-0.18.0_SNAPSHOT.2017.02.05-1.el7.centos.aurora.x86_64.rpm
aurora-scheduler-0.18.0_SNAPSHOT.2017.02.06-1.el7.centos.aurora.x86_64.rpm
aurora-scheduler-debuginfo-0.17.0_SNAPSHOT.2017.01.23-1.el7.centos.aurora.x86_64.rpm
aurora-scheduler-debuginfo-0.18.0_SNAPSHOT.2017.02.03-1.el7.centos.aurora.x86_64.rpm
aurora-scheduler-debuginfo-0.18.0_SNAPSHOT.2017.02.05-1.el7.centos.aurora.x86_64.rpm
aurora-scheduler-debuginfo-0.18.0_SNAPSHOT.2017.02.06-1.el7.centos.aurora.x86_64.rpm
aurora-tools-0.17.0_SNAPSHOT.2017.01.23-1.el7.centos.aurora.x86_64.rpm
aurora-tools-0.18.0_SNAPSHOT.2017.02.03-1.el7.centos.aurora.x86_64.rpm
aurora-tools-0.18.0_SNAPSHOT.2017.02.05-1.el7.centos.aurora.x86_64.rpm
aurora-tools-0.18.0_SNAPSHOT.2017.02.06-1.el7.centos.aurora.x86_64.rpm
repodata

artifacts/aurora-centos-7/dist/rpmbuild/RPMS/x86_64/repodata:
1477c8a9311f292af02954cf1cae5fed39f50ed3c1d2d9eb78a921bfba7bb7f2-other.sqlite.bz2
14dba906677f4228e9cae4010715e2b9dd06f81d96d9a7154922be41bf4ee34b-primary.sqlite.bz2
1867984acac2099cdae9845c5e7036052a0b7985c73b54fc5eed2ad647cb506a-filelists.sqlite.bz2
22225d2f1f3a1166ca6b0c10e26719ab21782114c8444a62a87ed008e0e53b62-other.xml.gz
252a993bbafab4383b598a1c77bf9d951f679e50bef76f7bdf6052dbb22b9ef2-filelists.xml.gz
2e8475c88f9c69c8a2c9822efef3e53f4d020711099afb4af4a84c504479d1e1-other.sqlite.bz2
2ebffad342a0efb1f0a8f3103956cc7afd1402169ac7dd4f64a9b7b7fd5121cf-filelists.xml.gz
2fc41ca8c4e3d6afae8b7275385d6dab953120dde910d8cf2b5cdc935ef727a6-other.sqlite.bz2
4aabd87a9b15e44334f9f6ace4fb320b027e8dee28eccb865ada088273699709-primary.xml.gz
4add7dbec26b95f86421c029f1d36180bbed7adbd45852104cb0ff4e9d435070-primary.xml.gz
58d1dd58f2bea8bd6e387799bdc9ed8cca8283fc983e16c0379e10c103895733-filelists.xml.gz
6cdce1815775a3739526d36e942b84e5804265c7f84c32e1649663d51f41283c-primary.sqlite.bz2
7af077a98b9f77aa7e9a69fb9b7174f2d058e918a8d591a08174a97dc429f893-filelists.xml.gz
7fa77cdb21b2896ebaaedb4822e1bfd26238de3c1b6baae21a52f55828c578d4-primary.xml.gz
8291f93f207afec5ec3fde8e91a830dc16e7d16d28ce7179b771e45b83fc9136-other.xml.gz
8c12207636d5a0d2d8fcba7096c1efb32080c5463ed171e0222b0a61b87cf4aa-filelists.sqlite.bz2
9caf2e56e9fd740ca64ffedd4bf3c8139d0ca0f73f5f7d9943f96d36a442c5d8-other.sqlite.bz2
9cb0ce9b2430087661863296647963f25763acd018d12d54d689bc1ba62da8ed-primary.sqlite.bz2
abf4859f34e33e32caced043abfaefdef7de71584003afe25012a324159a31b7-filelists.sqlite.bz2
ba7ad4b63456c175598e51f4923390c56aa1df2b4cf361cf3045deb1e09a43fb-primary.xml.gz
c965cbb4e474ebb98c77f91df720489b689eaaba2d4ad9577ec49032ac4eaa85-other.xml.gz
ccc7851b99d2e5983edf08f8ea7dbc75e29ab26ffacd777ee0f54c3280408cac-primary.sqlite.bz2
ea33952233e64996d05318842566d9920a79bf042066244c378aa418806d33a9-filelists.sqlite.bz2
f377af57bbefae9a52047fb0bc7feb4bf6cfba6301ae3adc741071af3054b6e8-other.xml.gz
repomd.xml

artifacts/aurora-centos-7/dist/rpmbuild/SOURCES:
apache-aurora-0.17.0_SNAPSHOT.2017.01.23.tar.gz
apache-aurora-0.18.0_SNAPSHOT.2017.02.03.tar.gz
apache-aurora-0.18.0_SNAPSHOT.2017.02.05.tar.gz
apache-aurora-0.18.0_SNAPSHOT.2017.02.06.tar.gz
aurora-pants.ini
aurora-scheduler.init.sh
aurora-scheduler.logrotate
aurora-scheduler.service
aurora-scheduler.startup.sh
aurora-scheduler.sysconfig
clusters.json
thermos.init.sh
thermos.logrotate
thermos.service
thermos.startup.sh
thermos.sysconfig

artifacts/aurora-centos-7/dist/rpmbuild/SRPMS:
aurora-scheduler-0.17.0_SNAPSHOT.2017.01.23-1.el7.centos.aurora.src.rpm
aurora-scheduler-0.18.0_SNAPSHOT.2017.02.03-1.el7.centos.aurora.src.rpm
aurora-scheduler-0.18.0_SNAPSHOT.2017.02.05-1.el7.centos.aurora.src.rpm
aurora-scheduler-0.18.0_SNAPSHOT.2017.02.06-1.el7.centos.aurora.src.rpm
builder/rpm/centos-7
Using docker image aurora-ubuntu-trusty
Sending build context to Docker daemon  5.12 kB

Step 1 : FROM ubuntu:trusty
 ---> 4d44acee901c
Step 2 : WORKDIR /aurora
 ---> Using cache
 ---> 557cc5655380
Step 3 : ENV HOME /aurora
 ---> Using cache
 ---> 1a9cbb986346
Step 4 : ENV DEBIAN_FRONTEND noninteractive
 ---> Using cache
 ---> 1eb0004c27dc
Step 5 : RUN apt-get update && apt-get -y install   bison   debhelper   devscripts
  dpkg-dev   curl   git   libapr1-dev   libcurl4-openssl-dev   libffi-dev   libsvn-dev   python-all-dev
  software-properties-common
 ---> Using cache
 ---> 5bbd9834c78c
Step 6 : RUN add-apt-repository -y ppa:openjdk-r/ppa   && apt-get update   &&
apt-get -y install openjdk-8-jdk   && update-alternatives --set java /usr/lib/jvm/java-8-openjdk-amd64/jre/bin/java
 ---> Using cache
 ---> 21e80f1fa477
Step 7 : RUN curl -sSL http://apache.org/dist/thrift/KEYS | gpg --import - &&    gpg
--export --armor 66B778F9 | sudo apt-key add - &&    echo 'deb http://www.apache.org/dist/thrift/debian
0.9.1 main' > /etc/apt/sources.list.d/thrift.list &&    apt-get update &&
   apt-get -y install thrift-compiler=0.9.1
 ---> Using cache
 ---> 51e1f3e7b5f7
Step 8 : RUN git clone --depth 1 https://github.com/benley/gradle-packaging   && cd
gradle-packaging   && apt-get -y install ruby ruby-dev unzip wget   && gem
install fpm && ./gradle-mkdeb.sh 3.1   && apt-get -y install gdebi-core  
&& gdebi --non-interactive gradle-3.1_3.1-2_all.deb   && cd .. &&
rm -rf gradle-packaging
 ---> Using cache
 ---> d88faa8f23a9
Step 9 : ADD build.sh /build.sh
 ---> Using cache
 ---> fd239dcc916f
Successfully built fd239dcc916f
+ mkdir /scratch
+ cd /scratch
+ tar --strip-components 1 -C . -xf /src.tar.gz
+ cp -R /specs/debian .
+ export 'DEBFULLNAME=Apache Aurora'
+ DEBFULLNAME='Apache Aurora'
+ export DEBEMAIL=dev@aurora.apache.org
+ DEBEMAIL=dev@aurora.apache.org
++ date -R
+ dch --newversion 0.18.0-SNAPSHOT.2017.02.06 --package apache-aurora --urgency medium 'Apache
Aurora package builder <dev@aurora.apache.org> Mon, 06 Feb 2017 00:38:03 +0000'
dch warning: Previous package version was Debian native whilst new version is not
+ dch --release ''
+ dpkg-buildpackage -uc -b -tc
dpkg-buildpackage: source package apache-aurora
dpkg-buildpackage: source version 0.18.0-SNAPSHOT.2017.02.06
dpkg-buildpackage: source distribution trusty
dpkg-buildpackage: source changed by Apache Aurora <dev@aurora.apache.org>
dpkg-buildpackage: host architecture amd64
 dpkg-source --before-build scratch
 debian/rules clean
dh clean --exclude=aurora-scheduler.bat
   dh_testdir -O--exclude=aurora-scheduler.bat
   dh_auto_clean -O--exclude=aurora-scheduler.bat
   dh_clean -O--exclude=aurora-scheduler.bat
 debian/rules build
dh build --exclude=aurora-scheduler.bat
   dh_testdir -O--exclude=aurora-scheduler.bat
   dh_auto_configure -O--exclude=aurora-scheduler.bat
   debian/rules override_dh_auto_build
make[1]: Entering directory `/scratch'
/usr/bin/gradle installDist
Starting a Gradle Daemon (subsequent builds will be faster)
> Starting Daemon> Starting Daemon > Connecting to Daemon> LoadingInvalidating
buildSrc state cache (/scratch/buildSrc/.gradle/noVersion/buildSrc) as it was not closed cleanly.
> Loading > buildSrc > settings> Loading > buildSrc> Loading > buildSrc
> Compiling jar:file:/opt/gradle-3.1/lib/gradle-core-3.1.jar!/org/gradle/initialization/buildsrc/defaultBuildSourceScript.txt
into local build cache> Loading > buildSrc > Compiling jar:file:/opt/gradle-3.1/lib/gradle-core-3.1.jar!/org/gradle/initialization/buildsrc/defaultBuildSourceScript.txt
into local build cache > Compiling script 'jar:file:/opt/gradle-3.1/lib/gradle-core-3.1.jar!/org/gradle/initialization/buildsrc/defaultBuildSourceScript.txt'
to cross build script cache> Loading > buildSrcGenerating JAR file 'gradle-api-3.1.jar'
> Loading > buildSrc> Loading > buildSrc > Generating 0%> Loading > buildSrc
> Generating 1%> Loading > buildSrc > Generating 2%> Loading > buildSrc
> Generating 3%> Loading > buildSrc > Generating 4%> Loading > buildSrc
> Generating 9%> Loading > buildSrc > Generating 20%> Loading > buildSrc
> Generating 25%> Loading > buildSrc > Generating 26%> Loading > buildSrc
> Generating 27%> Loading > buildSrc > Generating 28%> Loading > buildSrc
> Generating 29%> Loading > buildSrc > Generating 34%> Loading > buildSrc
> Generating 38%> Loading > buildSrc > Generating 42%> Loading > buildSrc
> Generating 46%> Loading > buildSrc > Generating 47%> Loading > buildSrc
> Generating 49%> Loading > buildSrc > Generating 50%> Loading > buildSrc
> Generating 51%> Loading > buildSrc > Generating 52%> Loading > buildSrc
> Generating 55%> Loading > buildSrc > Generating 58%> Loading > buildSrc
> Generating 59%> Loading > buildSrc > Generating 62%> Loading > buildSrc
> Generating 63%> Loading > buildSrc > Generating 64%> Loading > buildSrc
> Generating 67%> Loading > buildSrc > Generating 69%> Loading > buildSrc
> Generating 70%> Loading > buildSrc > Generating 74%> Loading > buildSrc
> Generating 76%> Loading > buildSrc > Generating 77%> Loading > buildSrc
> Generating 79%> Loading > buildSrc > Generating 84%> Loading > buildSrc
> Generating 85%> Loading > buildSrc > Generating 87%> Loading > buildSrc
> Generating 88%> Loading > buildSrc > Generating 92%> Loading > buildSrc
> Generating 94%> Loading > buildSrc > Generating 96%> Loading > buildSrc
> Generating 100%                                        
> Loading > buildSrc> Loading > buildSrc > Compiling /scratch/buildSrc/build.gradle
into local build cache> Loading > buildSrc > Compiling /scratch/buildSrc/build.gradle
into local build cache > Compiling build file '/scratch/buildSrc/build.gradle' to cross
build script cache> Loading > buildSrc > Compiling /scratch/buildSrc/build.gradle
into local build cache> Loading > buildSrc > Resolving dependencies ':runtime'>
Loading > buildSrc:buildSrc:clean UP-TO-DATE
:buildSrc:compileJava UP-TO-DATE
> Loading > buildSrc > :buildSrc:compileGroovy:buildSrc:compileGroovy
> Loading > buildSrc:buildSrc:processResources UP-TO-DATE
:buildSrc:classes
:buildSrc:jar
:buildSrc:assemble
:buildSrc:compileTestJava UP-TO-DATE
:buildSrc:compileTestGroovy UP-TO-DATE
:buildSrc:processTestResources UP-TO-DATE
:buildSrc:testClasses UP-TO-DATE
:buildSrc:test UP-TO-DATE
:buildSrc:check UP-TO-DATE
:buildSrc:build
> Loading > buildSrc> Loading> Configuring> Configuring > 0/5 projects >
root project > Compiling /scratch/build.gradle into local build cache > Compiling build
file '/scratch/build.gradle' to cross build script cache> Configuring > 0/5 projects
> root project > Compiling /scratch/build.gradle into local build cache> Configuring
> 0/5 projects > root project> Configuring > 0/5 projects
FAILURE: Build failed with an exception.

* Where:
Build file '/scratch/build.gradle' line: 18

* What went wrong:
Error resolving plugin [id: 'com.eriwen.gradle.js', version: '1.12.1']
> org.apache.http.ssl.SSLInitializationException: /usr/lib/jvm/java-8-openjdk-amd64/jre/lib/security/cacerts
(No such file or directory)

* Try:
Run with --stacktrace option to get the stack trace. Run with --info or --debug option to
get more log output.

BUILD FAILED

Total time: 18.801 secs
make[1]: *** [__gradle_build] Error 1
make[1]: Leaving directory `/scratch'
make: *** [build] Error 2
dpkg-buildpackage: error: debian/rules build gave error exit status 2
Build step 'Execute shell' marked build as failure
Skipped archiving because build is not successful

Mime
View raw message