aurora-dev mailing list archives

Site index · List index
Message view « Date » · « Thread »
Top « Date » · « Thread »
From "Erb, Stephan" <Stephan....@blue-yonder.com>
Subject Re: Build failed in Jenkins: Aurora #1715
Date Mon, 23 Jan 2017 07:52:56 GMT
The latest gradle has a couple of bugfixes. We should try and see if an update helps here.

On 17/01/2017, 23:45, "John Sirois" <john.sirois@gmail.com> wrote:

    So, this one again:
    
    Exception applying rule InvalidSlf4jMessageFormat on file
    /home/jenkins/jenkins-slave/workspace/Aurora/src/main/java/org/apache/aurora/scheduler/cron/quartz/AuroraCronJob.java,
    continuing with next rule
    java.lang.NullPointerException
    	at net.sourceforge.pmd.lang.java.rule.logging.InvalidSlf4jMessageFormatRule.countPlaceholders(InvalidSlf4jMessageFormatRule.java:199)
    	at net.sourceforge.pmd.lang.java.rule.logging.InvalidSlf4jMessageFormatRule.getAmountOfExpectedArguments(InvalidSlf4jMessageFormatRule.java:192)
    	at net.sourceforge.pmd.lang.java.rule.logging.InvalidSlf4jMessageFormatRule.expectedArguments(InvalidSlf4jMessageFormatRule.java:171)
    	at net.sourceforge.pmd.lang.java.rule.logging.InvalidSlf4jMessageFormatRule.visit(InvalidSlf4jMessageFormatRule.java:88)
    
    
    But, more interesting further down in logs:
    
    
    :testJava HotSpot(TM) 64-Bit Server VM warning: INFO:
    os::commit_memory(0x000000077d700000, 191365120, 0) failed;
    error='Cannot allocate memory' (errno=12)
    
    #
    # There is insufficient memory for the Java Runtime Environment to continue.
    # Native memory allocation (mmap) failed to map 191365120 bytes for
    committing reserved memory.
    # An error report file with more information is saved as:
    # /home/jenkins/jenkins-slave/workspace/Aurora/hs_err_pid573.log
    #
    # There is insufficient memory for the Java Runtime Environment to continue.
    # Native memory allocation (mmap) failed to map 236453888 bytes for
    committing reserved memory.
    Java HotSpot(TM) 64-Bit Server VM warning: INFO:
    os::commit_memory(0x0000000787e80000, 236453888, 0) failed;
    error='Cannot allocate memory' (errno=12)
    # An error report file with more information is saved as:
    # /home/jenkins/jenkins-slave/workspace/Aurora/hs_err_pid577.log
    Could not stop org.gradle.internal.actor.internal.DefaultActorFactory$NonBlockingActor@5e850067.
    org.gradle.internal.dispatch.DispatchException: Could not dispatch
    message [MethodInvocation method: stop()].
    	at org.gradle.internal.dispatch.ExceptionTrackingFailureHandler.dispatchFailed(ExceptionTrackingFailureHandler.java:34)
    	at org.gradle.internal.dispatch.FailureHandlingDispatch.dispatch(FailureHandlingDispatch.java:31)
    	at org.gradle.internal.dispatch.AsyncDispatch.dispatchMessages(AsyncDispatch.java:132)
    	at org.gradle.internal.dispatch.AsyncDispatch.access$000(AsyncDispatch.java:33)
    	at org.gradle.internal.dispatch.AsyncDispatch$1.run(AsyncDispatch.java:72)
    	at org.gradle.internal.concurrent.ExecutorPolicy$CatchAndRecordFailures.onExecute(ExecutorPolicy.java:54)
    	at org.gradle.internal.concurrent.StoppableExecutorImpl$1.run(StoppableExecutorImpl.java:40)
    	at java.util.concurrent.ThreadPoolExecutor.runWorker(ThreadPoolExecutor.java:1142)
    	at java.util.concurrent.ThreadPoolExecutor$Worker.run(ThreadPoolExecutor.java:617)
    	at java.lang.Thread.run(Thread.java:745)
    Caused by: org.gradle.process.internal.ExecException: Process 'Gradle
    Test Executor 4' finished with non-zero exit value 1
    
    
    Test executors 6 and 7 also failed in this same way.
    
    
    On Tue, Jan 17, 2017 at 3:41 PM, Apache Jenkins Server <
    jenkins@builds.apache.org> wrote:
    
    > See <https://builds.apache.org/job/Aurora/1715/changes>
    >
    > Changes:
    >
    > [john.sirois] Ensure Aurora thrift support js and html.
    >
    > ------------------------------------------
    > [...truncated 3475 lines...]
    >   Test coverage missing for org/apache/aurora/scheduler/
    > storage/db/DbJobUpdateStore$2
    >   Test coverage missing for org/apache/aurora/scheduler/
    > storage/db/DbCronJobStore
    >   Test coverage missing for org/apache/aurora/scheduler/
    > storage/db/DbModule$1$1
    >   Test coverage missing for org/apache/aurora/scheduler/
    > storage/db/DbModule$GarbageCollectorModule$1
    >   Test coverage missing for org/apache/aurora/scheduler/
    > storage/db/InsertResult
    >   Test coverage missing for org/apache/aurora/scheduler/
    > storage/db/DbStorage
    >   Test coverage missing for org/apache/aurora/scheduler/
    > storage/db/DbModule
    >   Test coverage missing for org/apache/aurora/scheduler/
    > storage/db/DbSchedulerStore
    >   Test coverage missing for org/apache/aurora/scheduler/storage/db/DbUtil
    >   Test coverage missing for org/apache/aurora/scheduler/resources/
    > MesosResourceConverter$RangeConverter
    >   Test coverage missing for org/apache/aurora/scheduler/
    > resources/ResourceBag
    >   Test coverage missing for org/apache/aurora/scheduler/resources/
    > AuroraResourceConverter
    >   Test coverage missing for org/apache/aurora/scheduler/resources/
    > AuroraResourceConverter$LongConverter
    >   Test coverage missing for org/apache/aurora/scheduler/
    > resources/ResourceSettings
    >   Test coverage missing for org/apache/aurora/scheduler/
    > resources/AcceptedOffer
    >   Test coverage missing for org/apache/aurora/scheduler/
    > resources/ResourceManager
    >   Test coverage missing for org/apache/aurora/scheduler/resources/
    > AuroraResourceConverter$StringConverter
    >   Test coverage missing for org/apache/aurora/scheduler/
    > resources/ResourceType
    >   Test coverage missing for org/apache/aurora/scheduler/resources/
    > MesosResourceConverter$ScalarConverter
    >   Test coverage missing for org/apache/aurora/scheduler/resources/
    > AuroraResourceConverter$DoubleConverter
    >   Test coverage missing for org/apache/aurora/scheduler/
    > resources/ResourceMapper$PortMapper
    >   Test coverage missing for org/apache/aurora/scheduler/
    > state/TaskStateMachine$2
    >   Test coverage missing for org/apache/aurora/scheduler/
    > state/TaskStateMachine$1
    >   Test coverage missing for org/apache/aurora/scheduler/
    > state/TransitionResult
    >   Test coverage missing for org/apache/aurora/scheduler/
    > state/TaskStateMachine
    >   Test coverage missing for org/apache/aurora/scheduler/
    > state/TaskStateMachine$TaskState
    >   Test coverage missing for org/apache/aurora/scheduler/state/StateModule
    >   Test coverage missing for org/apache/aurora/scheduler/
    > state/MaintenanceController$MaintenanceControllerImpl
    >   Test coverage missing for org/apache/aurora/scheduler/
    > state/TaskAssigner$TaskAssignerImpl
    >   Test coverage missing for org/apache/aurora/scheduler/state/SideEffect
    >   Test coverage missing for org/apache/aurora/scheduler/
    > state/LockManagerImpl
    >   Test coverage missing for org/apache/aurora/scheduler/
    > state/UUIDGenerator$UUIDGeneratorImpl
    >   Test coverage missing for org/apache/aurora/scheduler/
    > state/StateManagerImpl
    >   Test coverage missing for org/apache/aurora/scheduler/discovery/
    > CuratorSingletonService
    >   Test coverage missing for org/apache/aurora/scheduler/discovery/
    > CuratorServiceDiscoveryModule$2
    >   Test coverage missing for org/apache/aurora/scheduler/discovery/
    > CuratorServiceDiscoveryModule$SingleACLProvider
    >   Test coverage missing for org/apache/aurora/scheduler/discovery/
    > CuratorSingletonService$1$1
    >   Test coverage missing for org/apache/aurora/scheduler/discovery/
    > CuratorSingletonService$Advertiser
    >   Test coverage missing for org/apache/aurora/scheduler/discovery/
    > CommonsServiceGroupMonitor
    >   Test coverage missing for org/apache/aurora/scheduler/
    > discovery/ZooKeeperConfig
    >   Test coverage missing for org/apache/aurora/scheduler/discovery/
    > CuratorSingletonService$1
    >   Test coverage missing for org/apache/aurora/scheduler/discovery/
    > CuratorServiceDiscoveryModule
    >   Test coverage missing for org/apache/aurora/scheduler/discovery/
    > ServiceDiscoveryModule
    >   Test coverage missing for org/apache/aurora/scheduler/discovery/
    > CommonsServiceDiscoveryModule
    >   Test coverage missing for org/apache/aurora/scheduler/discovery/
    > CuratorServiceGroupMonitor
    >   Test coverage missing for org/apache/aurora/scheduler/http/api/
    > GsonMessageBodyHandler
    >   Test coverage missing for org/apache/aurora/scheduler/
    > http/api/TContentAwareServlet
    >   Test coverage missing for org/apache/aurora/scheduler/http/api/ApiBeta
    >   Test coverage missing for org/apache/aurora/scheduler/
    > http/api/TContentAwareServlet$OutputConfig
    >   Test coverage missing for org/apache/aurora/scheduler/
    > http/api/TContentAwareServlet$ContentFactoryPair
    >   Test coverage missing for org/apache/aurora/scheduler/http/api/
    > GsonMessageBodyHandler$1
    >   Test coverage missing for org/apache/aurora/scheduler/
    > http/api/TContentAwareServlet$InputConfig
    >   Test coverage missing for org/apache/aurora/scheduler/http/api/ApiModule
    >   Test coverage missing for org/apache/aurora/codec/ThriftBinaryCodec
    >   Test coverage missing for org/apache/aurora/scheduler/
    > reconciliation/KillRetry
    >   Test coverage missing for org/apache/aurora/scheduler/
    > reconciliation/TaskTimeout
    >   Test coverage missing for org/apache/aurora/scheduler/
    > reconciliation/TaskReconciler
    >   Test coverage missing for org/apache/aurora/scheduler/reconciliation/
    > ReconciliationModule$3
    >   Test coverage missing for org/apache/aurora/scheduler/reconciliation/
    > ReconciliationModule$2
    >   Test coverage missing for org/apache/aurora/scheduler/reconciliation/
    > ReconciliationModule$1
    >   Test coverage missing for org/apache/aurora/scheduler/
    > reconciliation/KillRetry$KillAttempt
    >   Test coverage missing for org/apache/aurora/scheduler/
    > reconciliation/TaskTimeout$TimedOutTaskHandler
    >   Test coverage missing for org/apache/aurora/scheduler/reconciliation/
    > ReconciliationModule
    >   Test coverage missing for org/apache/aurora/scheduler/
    > cron/quartz/CronPredictorImpl
    >   Test coverage missing for org/apache/aurora/scheduler/
    > cron/quartz/AuroraCronJob$CronBatchWorker
    >   Test coverage missing for org/apache/aurora/scheduler/
    > cron/quartz/CronLifecycle
    >   Test coverage missing for org/apache/aurora/scheduler/
    > cron/quartz/CronModule
    >   Test coverage missing for org/apache/aurora/scheduler/
    > cron/quartz/AuroraCronJob
    >   Test coverage missing for org/apache/aurora/scheduler/cron/quartz/Quartz
    >   Test coverage missing for org/apache/aurora/scheduler/cron/quartz/
    > AuroraCronJobFactory
    >   Test coverage missing for org/apache/aurora/scheduler/
    > cron/quartz/AuroraCronJob$Config
    >   Test coverage missing for org/apache/aurora/scheduler/
    > cron/quartz/CronJobManagerImpl
    >   Test coverage missing for org/apache/aurora/scheduler/
    > scheduling/TaskThrottler
    >   Test coverage missing for org/apache/aurora/scheduler/scheduling/
    > RescheduleCalculator$RescheduleCalculatorImpl$1
    >   Test coverage missing for org/apache/aurora/scheduler/
    > scheduling/SchedulingModule$1
    >   Test coverage missing for org/apache/aurora/scheduler/
    > scheduling/SchedulingModule$4
    >   Test coverage missing for org/apache/aurora/scheduler/
    > scheduling/SchedulingModule$3
    >   Test coverage missing for org/apache/aurora/scheduler/
    > scheduling/TaskGroups$TaskGroupBatchWorker
    >   Test coverage missing for org/apache/aurora/scheduler/
    > scheduling/TaskGroups$1
    >   Test coverage missing for org/apache/aurora/scheduler/
    > scheduling/TaskScheduler$TaskSchedulerImpl
    >   Test coverage missing for org/apache/aurora/scheduler/
    > scheduling/SchedulingModule
    >   Test coverage missing for org/apache/aurora/scheduler/scheduling/
    > RescheduleCalculator$RescheduleCalculatorImpl
    >   Test coverage missing for org/apache/aurora/scheduler/
    > scheduling/TaskGroup
    >   Test coverage missing for org/apache/aurora/scheduler/
    > scheduling/TaskGroups
    >   Test coverage missing for org/apache/aurora/scheduler/configuration/
    > ConfigurationManager
    >   Test coverage missing for org/apache/aurora/scheduler/configuration/
    > SanitizedConfiguration
    >   Test coverage missing for org/apache/aurora/scheduler/configuration/
    > ConfigurationManager$RequiredFieldValidator
    >   Test coverage missing for org/apache/aurora/scheduler/configuration/
    > ConfigurationManager$GreaterThan
    >   Test coverage missing for org/apache/aurora/scheduler/
    > quota/QuotaCheckResult
    >   Test coverage missing for org/apache/aurora/scheduler/quota/QuotaModule
    >   Test coverage missing for org/apache/aurora/scheduler/quota/QuotaInfo
    >   Test coverage missing for org/apache/aurora/scheduler/quota/QuotaManager
    >   Test coverage missing for org/apache/aurora/scheduler/
    > quota/QuotaManager$QuotaManagerImpl
    >   Test coverage missing for org/apache/aurora/scheduler/
    > storage/mem/MemCronJobStore
    >   Test coverage missing for org/apache/aurora/scheduler/
    > storage/mem/InMemStoresModule
    >   Test coverage missing for org/apache/aurora/scheduler/
    > storage/mem/Interner
    >   Test coverage missing for org/apache/aurora/scheduler/
    > storage/mem/MemTaskStore$1
    >   Test coverage missing for org/apache/aurora/scheduler/
    > storage/mem/MemTaskStore$SecondaryIndex$2
    >   Test coverage missing for org/apache/aurora/scheduler/
    > storage/mem/MemTaskStore$SecondaryIndex$1
    >   Test coverage missing for org/apache/aurora/scheduler/
    > storage/mem/MemTaskStore$SecondaryIndex
    >   Test coverage missing for org/apache/aurora/scheduler/
    > storage/mem/MemTaskStore
    >   Test coverage missing for org/apache/aurora/scheduler/
    > updater/strategy/BatchStrategy
    >   Test coverage missing for org/apache/aurora/scheduler/updater/strategy/
    > ActiveLimitedStrategy
    >   Test coverage missing for org/apache/aurora/scheduler/
    > updater/strategy/QueueStrategy
    >   Test coverage missing for org/apache/aurora/scheduler/
    > testing/FakeStatsProvider
    >   Test coverage missing for org/apache/aurora/scheduler/
    > offers/OfferManager$OfferManagerImpl
    >   Test coverage missing for org/apache/aurora/scheduler/
    > offers/OfferManager$OfferManagerImpl$HostOffers
    >   Test coverage missing for org/apache/aurora/scheduler/
    > offers/OffersModule
    >   Test coverage missing for org/apache/aurora/scheduler/
    > offers/OfferManager$OfferManagerImpl$HostOffers$1
    >   Test coverage missing for org/apache/aurora/scheduler/
    > offers/OfferSettings
    >   Test coverage missing for org/apache/aurora/scheduler/
    > offers/RandomJitterReturnDelay
    >   Test coverage missing for org/apache/aurora/scheduler/
    > offers/OffersModule$1
    >   Test coverage missing for org/apache/aurora/scheduler/
    > mesos/SchedulerDriverService
    >   Test coverage missing for org/apache/aurora/scheduler/
    > mesos/MesosTaskFactory$MesosTaskFactoryImpl
    >   Test coverage missing for org/apache/aurora/scheduler/
    > mesos/TaskStatusStats$3
    >   Test coverage missing for org/apache/aurora/scheduler/
    > mesos/TaskStatusStats$2
    >   Test coverage missing for org/apache/aurora/scheduler/
    > mesos/TaskStatusStats$1
    >   Test coverage missing for org/apache/aurora/scheduler/
    > mesos/SchedulerDriverModule$1
    >   Test coverage missing for org/apache/aurora/scheduler/
    > mesos/TestExecutorSettings
    >   Test coverage missing for org/apache/aurora/scheduler/
    > mesos/MesosSchedulerImpl
    >   Test coverage missing for org/apache/aurora/scheduler/
    > mesos/SchedulerDriverModule
    >   Test coverage missing for org/apache/aurora/scheduler/mesos/
    > CommandLineDriverSettingsModule
    >   Test coverage missing for org/apache/aurora/scheduler/
    > mesos/TaskStatusStats
    >   Test coverage missing for org/apache/aurora/scheduler/
    > mesos/DriverSettings
    >   Test coverage missing for org/apache/aurora/scheduler/
    > thrift/aop/LoggingInterceptor
    >   Test coverage missing for org/apache/aurora/scheduler/thrift/aop/
    > ServerInfoInterceptor
    >   Test coverage missing for org/apache/aurora/scheduler/thrift/aop/
    > ThriftStatsExporterInterceptor$1
    >   Test coverage missing for org/apache/aurora/scheduler/
    > thrift/aop/LoggingInterceptor$1
    >   Test coverage missing for org/apache/aurora/scheduler/
    > thrift/aop/AopModule
    >   Test coverage missing for org/apache/aurora/scheduler/thrift/aop/
    > ThriftStatsExporterInterceptor
    >   Test coverage missing for org/apache/aurora/scheduler/thrift/Responses
    >   Test coverage missing for org/apache/aurora/scheduler/
    > thrift/ThriftModule$ReadOnly
    >   Test coverage missing for org/apache/aurora/scheduler/
    > thrift/ReadOnlySchedulerImpl
    >   Test coverage missing for org/apache/aurora/scheduler/
    > thrift/ThriftModule
    >   Test coverage missing for org/apache/aurora/scheduler/
    > thrift/AuditMessages
    >   Test coverage missing for org/apache/aurora/scheduler/thrift/Thresholds
    >   Test coverage missing for org/apache/aurora/scheduler/thrift/
    > SchedulerThriftInterface
    >   Test coverage missing for org/apache/aurora/scheduler/
    > preemptor/Preemptor$PreemptorImpl
    >   Test coverage missing for org/apache/aurora/scheduler/preemptor/
    > PreemptionVictimFilter$PreemptionVictimFilterImpl
    >   Test coverage missing for org/apache/aurora/scheduler/
    > preemptor/BiCache$1
    >   Test coverage missing for org/apache/aurora/scheduler/
    > preemptor/BiCache$2
    >   Test coverage missing for org/apache/aurora/scheduler/
    > preemptor/PendingTaskProcessor
    >   Test coverage missing for org/apache/aurora/scheduler/
    > preemptor/ClusterStateImpl
    >   Test coverage missing for org/apache/aurora/scheduler/
    > preemptor/PreemptionProposal
    >   Test coverage missing for org/apache/aurora/scheduler/preemptor/
    > PendingTaskProcessor$1
    >   Test coverage missing for org/apache/aurora/scheduler/preemptor/
    > PendingTaskProcessor$2
    >   Test coverage missing for org/apache/aurora/scheduler/preemptor/
    > PendingTaskProcessor$3
    >   Test coverage missing for org/apache/aurora/scheduler/
    > preemptor/PreemptorModule$PreemptorService
    >   Test coverage missing for org/apache/aurora/scheduler/preemptor/
    > PreemptionVictimFilter$PreemptionVictimFilterImpl$2
    >   Test coverage missing for org/apache/aurora/scheduler/preemptor/
    > PreemptionVictimFilter$PreemptionVictimFilterImpl$1
    >   Test coverage missing for org/apache/aurora/scheduler/
    > preemptor/PreemptorMetrics
    >   Test coverage missing for org/apache/aurora/scheduler/
    > preemptor/PreemptorModule$1
    >   Test coverage missing for org/apache/aurora/scheduler/
    > preemptor/PreemptorModule
    >   Test coverage missing for org/apache/aurora/scheduler/
    > preemptor/PreemptionVictim
    >   Test coverage missing for org/apache/aurora/scheduler/preemptor/BiCache
    >   Test coverage missing for org/apache/aurora/scheduler/
    > events/PubsubEvent$DriverDisconnected
    >   Test coverage missing for org/apache/aurora/scheduler/
    > events/WebhookModule
    >   Test coverage missing for org/apache/aurora/scheduler/
    > events/PubsubEvent$TaskStatusReceived
    >   Test coverage missing for org/apache/aurora/scheduler/
    > events/PubsubEventModule
    >   Test coverage missing for org/apache/aurora/scheduler/
    > events/PubsubEvent$TaskStateChange
    >   Test coverage missing for org/apache/aurora/scheduler/
    > events/PubsubEvent$Vetoed
    >   Test coverage missing for org/apache/aurora/scheduler/events/
    > NotifyingSchedulingFilter
    >   Test coverage missing for org/apache/aurora/scheduler/
    > events/PubsubEventModule$1
    >   Test coverage missing for org/apache/aurora/scheduler/
    > events/PubsubEvent$TasksDeleted
    >   Test coverage missing for org/apache/aurora/scheduler/
    > events/PubsubEventModule$RegisterSubscribers
    >   Test coverage missing for org/apache/aurora/scheduler/events/Webhook
    >   Test coverage missing for org/apache/aurora/scheduler/
    > events/PubsubEvent$DriverRegistered
    >   Test coverage missing for org/apache/aurora/scheduler/events/WebhookInfo
    >   Test coverage missing for org/apache/aurora/scheduler/
    > events/PubsubEvent$HostAttributesChanged
    >   Test coverage missing for org/apache/aurora/scheduler/storage/log/
    > WriteAheadStorageForwarder
    >   Test coverage missing for org/apache/aurora/scheduler/
    > storage/log/LogStorage$1
    >   Test coverage missing for org/apache/aurora/scheduler/
    > storage/log/StreamManagerImpl$StreamTransactionImpl
    >   Test coverage missing for org/apache/aurora/scheduler/
    > storage/log/SnapshotStoreImpl
    >   Test coverage missing for org/apache/aurora/scheduler/
    > storage/log/EntrySerializer$EntrySerializerImpl$1
    >   Test coverage missing for org/apache/aurora/scheduler/
    > storage/log/SnapshotStoreImpl$8
    >   Test coverage missing for org/apache/aurora/scheduler/
    > storage/log/SnapshotStoreImpl$7
    >   Test coverage missing for org/apache/aurora/scheduler/
    > storage/log/SnapshotStoreImpl$4
    >   Test coverage missing for org/apache/aurora/scheduler/
    > storage/log/SnapshotStoreImpl$3
    >   Test coverage missing for org/apache/aurora/scheduler/
    > storage/log/SnapshotStoreImpl$6
    >   Test coverage missing for org/apache/aurora/scheduler/
    > storage/log/SnapshotStoreImpl$5
    >   Test coverage missing for org/apache/aurora/scheduler/
    > storage/log/SnapshotStoreImpl$2
    >   Test coverage missing for org/apache/aurora/scheduler/
    > storage/log/SnapshotStoreImpl$1
    >   Test coverage missing for org/apache/aurora/scheduler/
    > storage/log/LogStorage$Settings
    >   Test coverage missing for org/apache/aurora/scheduler/
    > storage/log/StreamManagerImpl
    >   Test coverage missing for org/apache/aurora/scheduler/
    > storage/log/EntrySerializer$EntrySerializerImpl
    >   Test coverage missing for org/apache/aurora/scheduler/
    > storage/log/ThriftBackfill
    >   Test coverage missing for org/apache/aurora/scheduler/
    > storage/log/LogStorage$ScheduledExecutorSchedulingService
    >   Test coverage missing for org/apache/aurora/scheduler/
    > storage/log/LogStorageModule
    >   Test coverage missing for org/apache/aurora/scheduler/
    > storage/log/LogStorage
    >   Test coverage missing for org/apache/aurora/scheduler/storage/log/
    > SnapshotDeduplicator$SnapshotDeduplicatorImpl
    >   Test coverage missing for org/apache/aurora/scheduler/
    > storage/log/Entries
    >   Test coverage missing for org/apache/aurora/scheduler/
    > storage/log/WriteAheadStorage
    >   Test coverage missing for org/apache/aurora/scheduler/
    > storage/log/LogManager
    >   Test coverage missing for org/apache/aurora/scheduler/storage/backup/
    > TemporaryStorage$TemporaryStorageFactory$1
    >   Test coverage missing for org/apache/aurora/scheduler/
    > storage/backup/StorageBackup$StorageBackupImpl$BackupConfig
    >   Test coverage missing for org/apache/aurora/scheduler/
    > storage/backup/BackupModule
    >   Test coverage missing for org/apache/aurora/scheduler/
    > storage/backup/Recovery$RecoveryImpl
    >   Test coverage missing for org/apache/aurora/scheduler/
    > storage/backup/StorageBackup$StorageBackupImpl
    >   Test coverage missing for org/apache/aurora/scheduler/storage/backup/
    > TemporaryStorage$TemporaryStorageFactory
    >   Test coverage missing for org/apache/aurora/scheduler/
    > storage/backup/Recovery$RecoveryImpl$PendingRecovery
    >   Test coverage missing for org/apache/aurora/scheduler/
    > SchedulerLifecycle$7
    >   Test coverage missing for org/apache/aurora/scheduler/
    > SchedulerLifecycle$6
    >   Test coverage missing for org/apache/aurora/scheduler/
    > SchedulerLifecycle$5
    >   Test coverage missing for org/apache/aurora/scheduler/
    > SchedulerLifecycle$4
    >   Test coverage missing for org/apache/aurora/scheduler/
    > SchedulerLifecycle$3
    >   Test coverage missing for org/apache/aurora/scheduler/
    > SchedulerLifecycle$2
    >   Test coverage missing for org/apache/aurora/scheduler/
    > SchedulerLifecycle$1
    >   Test coverage missing for org/apache/aurora/scheduler/HostOffer
    >   Test coverage missing for org/apache/aurora/scheduler/TaskVars
    >   Test coverage missing for org/apache/aurora/scheduler/
    > SchedulerLifecycle$SchedulerCandidateImpl
    >   Test coverage missing for org/apache/aurora/scheduler/BatchWorker$Work
    >   Test coverage missing for org/apache/aurora/scheduler/TierInfo
    >   Test coverage missing for org/apache/aurora/scheduler/
    > SchedulerLifecycle$DefaultDelayedActions
    >   Test coverage missing for org/apache/aurora/scheduler/
    > TierManager$TierManagerImpl$TierConfig
    >   Test coverage missing for org/apache/aurora/scheduler/TaskVars$Counter
    >   Test coverage missing for org/apache/aurora/scheduler/TaskVars$1
    >   Test coverage missing for org/apache/aurora/scheduler/SchedulerModule$
    > TaskEventBatchWorker
    >   Test coverage missing for org/apache/aurora/scheduler/BatchWorker
    >   Test coverage missing for org/apache/aurora/scheduler/HostOffer$1
    >   Test coverage missing for org/apache/aurora/scheduler/SchedulerModule
    >   Test coverage missing for org/apache/aurora/scheduler/TaskIdGenerator$
    > TaskIdGeneratorImpl
    >   Test coverage missing for org/apache/aurora/scheduler/
    > TierManager$TierManagerImpl
    >   Test coverage missing for org/apache/aurora/scheduler/SchedulerModule$1
    >   Test coverage missing for org/apache/aurora/scheduler/
    > TaskStatusHandlerImpl
    >   Test coverage missing for org/apache/aurora/scheduler/
    > SchedulerServicesModule
    >   Test coverage missing for org/apache/aurora/scheduler/
    > TaskStatusHandlerImpl$1
    >   Test coverage missing for org/apache/aurora/scheduler/TierModule
    >   Test coverage missing for org/apache/aurora/scheduler/SchedulerLifecycle
    >   Test coverage missing for org/apache/aurora/scheduler/
    > storage/db/typehandlers/ScheduleStatusTypeHandler
    >   Test coverage missing for org/apache/aurora/scheduler/
    > storage/db/typehandlers/VolumeModeTypeHandler
    >   Test coverage missing for org/apache/aurora/scheduler/
    > storage/db/typehandlers/TypeHandlers
    >   Test coverage missing for org/apache/aurora/scheduler/
    > storage/db/typehandlers/JobUpdateStatusTypeHandler
    >   Test coverage missing for org/apache/aurora/scheduler/
    > storage/db/typehandlers/MaintenanceModeTypeHandler
    >   Test coverage missing for org/apache/aurora/scheduler/
    > storage/db/typehandlers/CronCollisionPolicyTypeHandler
    >   Test coverage missing for org/apache/aurora/scheduler/
    > storage/db/typehandlers/AbstractTEnumTypeHandler
    >   Test coverage missing for org/apache/aurora/scheduler/
    > storage/db/typehandlers/JobUpdateActionTypeHandler
    >   Test coverage missing for org/apache/aurora/scheduler/
    > storage/db/typehandlers/ResourceTypeHandler
    >
    > * Try:
    > Run with --stacktrace option to get the stack trace. Run with --info or
    > --debug option to get more log output.
    > ============================================================
    > ==================
    >
    > BUILD FAILED
    >
    > Total time: 3 mins 58.656 secs
    > Build step 'Execute shell' marked build as failure
    > Recording test results
    > ERROR: Step ‘Publish JUnit test result report’ failed: No test report
    > files were found. Configuration error?
    >
    >
    

Mime
View raw message