aurora-dev mailing list archives

Site index · List index
Message view « Date » · « Thread »
Top « Date » · « Thread »
From Apache Jenkins Server <jenk...@builds.apache.org>
Subject Build failed in Jenkins: aurora-packaging-nightly #544
Date Fri, 13 Jan 2017 00:43:41 GMT
See <https://builds.apache.org/job/aurora-packaging-nightly/544/>

------------------------------------------
[...truncated 8339 lines...]
> Building 3% > :api:generateThriftJavathrift-0.9.1/test/DebugProtoTest.thrift
thrift-0.9.1/test/DenseLinkingTest.thrift
thrift-0.9.1/test/DocTest.thrift
thrift-0.9.1/test/FastbinaryTest.py
thrift-0.9.1/test/hs/
thrift-0.9.1/test/hs/ConstantsDemo_Main.hs
thrift-0.9.1/test/hs/DebugProtoTest_Main.hs
thrift-0.9.1/test/hs/Makefile
thrift-0.9.1/test/hs/Makefile.am
thrift-0.9.1/test/hs/Makefile.in
thrift-0.9.1/test/hs/run-test.sh
thrift-0.9.1/test/hs/ThriftTest_Main.hs
thrift-0.9.1/test/hs/ThriftTestUtils.hs
thrift-0.9.1/test/Include.thrift
thrift-0.9.1/test/JavaBeansTest.thrift
thrift-0.9.1/test/Makefile.am
thrift-0.9.1/test/Makefile.in
thrift-0.9.1/test/ManyOptionals.thrift
thrift-0.9.1/test/ManyTypedefs.thrift
thrift-0.9.1/test/nodejs/
thrift-0.9.1/test/nodejs/client.js
thrift-0.9.1/test/nodejs/Makefile
thrift-0.9.1/test/nodejs/Makefile.am
thrift-0.9.1/test/nodejs/Makefile.in
thrift-0.9.1/test/nodejs/package.json
thrift-0.9.1/test/nodejs/server.js
thrift-0.9.1/test/ocaml/
thrift-0.9.1/test/ocaml/client/
thrift-0.9.1/test/ocaml/client/Makefile
thrift-0.9.1/test/ocaml/client/TestClient.ml
thrift-0.9.1/test/ocaml/Makefile
thrift-0.9.1/test/ocaml/server/
thrift-0.9.1/test/ocaml/server/Makefile
thrift-0.9.1/test/ocaml/server/TestServer.ml
thrift-0.9.1/test/OptionalRequiredTest.thrift
thrift-0.9.1/test/perl/
thrift-0.9.1/test/perl/Makefile
thrift-0.9.1/test/perl/Makefile.am
thrift-0.9.1/test/perl/Makefile.in
thrift-0.9.1/test/perl/TestClient.pl
thrift-0.9.1/test/php/
thrift-0.9.1/test/php/Makefile
thrift-0.9.1/test/php/Makefile.am
thrift-0.9.1/test/php/Makefile.in
thrift-0.9.1/test/php/TestClient.php
thrift-0.9.1/test/php/TestInline.php
thrift-0.9.1/test/py/
thrift-0.9.1/test/py/explicit_module/
thrift-0.9.1/test/py/explicit_module/runtest.sh
thrift-0.9.1/test/py/explicit_module/test1.thrift
thrift-0.9.1/test/py/explicit_module/test2.thrift
thrift-0.9.1/test/py/Makefile
thrift-0.9.1/test/py/Makefile.am
thrift-0.9.1/test/py/Makefile.in
thrift-0.9.1/test/py/RunClientServer.py
thrift-0.9.1/test/py/SerializationTest.py
thrift-0.9.1/test/py/test_cert.pem
thrift-0.9.1/test/py/test_cert.readme
thrift-0.9.1/test/py/TestClient.py
thrift-0.9.1/test/py/TestEof.py
thrift-0.9.1/test/py/TestServer.py
thrift-0.9.1/test/py/TestSocket.py
thrift-0.9.1/test/py/TestSyntax.py
thrift-0.9.1/test/py/TSimpleJSONProtocolTest.py
thrift-0.9.1/test/py.tornado/
thrift-0.9.1/test/py.tornado/Makefile
thrift-0.9.1/test/py.tornado/Makefile.am
thrift-0.9.1/test/py.tornado/Makefile.in
thrift-0.9.1/test/py.tornado/test_suite.py
thrift-0.9.1/test/py.twisted/
thrift-0.9.1/test/py.twisted/_trial_temp/
thrift-0.9.1/test/py.twisted/_trial_temp/_trial_marker
thrift-0.9.1/test/py.twisted/_trial_temp/test.log
thrift-0.9.1/test/py.twisted/Makefile
thrift-0.9.1/test/py.twisted/Makefile.am
thrift-0.9.1/test/py.twisted/Makefile.in
thrift-0.9.1/test/py.twisted/test_suite.py
thrift-0.9.1/test/py.twisted/test_suite.pyc
thrift-0.9.1/test/rb/
thrift-0.9.1/test/rb/benchmarks/
thrift-0.9.1/test/rb/benchmarks/protocol_benchmark.rb
thrift-0.9.1/test/rb/core/
thrift-0.9.1/test/rb/core/test_backwards_compatability.rb
thrift-0.9.1/test/rb/core/test_exceptions.rb
thrift-0.9.1/test/rb/core/transport/
thrift-0.9.1/test/rb/core/transport/test_transport.rb
thrift-0.9.1/test/rb/fixtures/
thrift-0.9.1/test/rb/fixtures/structs.rb
thrift-0.9.1/test/rb/generation/
thrift-0.9.1/test/rb/generation/test_enum.rb
thrift-0.9.1/test/rb/generation/test_struct.rb
thrift-0.9.1/test/rb/integration/
thrift-0.9.1/test/rb/integration/accelerated_buffered_client.rb
thrift-0.9.1/test/rb/integration/accelerated_buffered_server.rb
thrift-0.9.1/test/rb/integration/buffered_client.rb
thrift-0.9.1/test/rb/integration/simple_client.rb
thrift-0.9.1/test/rb/integration/simple_server.rb
thrift-0.9.1/test/rb/integration/test_simple_handler.rb
thrift-0.9.1/test/rb/Makefile
thrift-0.9.1/test/rb/Makefile.am
thrift-0.9.1/test/rb/Makefile.in
thrift-0.9.1/test/rb/test_helper.rb
thrift-0.9.1/test/rb/test_suite.rb
thrift-0.9.1/test/SmallTest.thrift
thrift-0.9.1/test/StressTest.thrift
thrift-0.9.1/test/test.sh
thrift-0.9.1/test/threads/
thrift-0.9.1/test/threads/Makefile
thrift-0.9.1/test/threads/ThreadsClient.cpp
thrift-0.9.1/test/threads/ThreadsServer.cpp
thrift-0.9.1/test/threads/ThreadsTest.thrift
thrift-0.9.1/test/ThriftTest.thrift
thrift-0.9.1/tutorial/
thrift-0.9.1/tutorial/cpp/
thrift-0.9.1/tutorial/cpp/CppClient.cpp
thrift-0.9.1/tutorial/cpp/CppServer.cpp
thrift-0.9.1/tutorial/cpp/Makefile.am
thrift-0.9.1/tutorial/cpp/Makefile.in
thrift-0.9.1/tutorial/csharp/
thrift-0.9.1/tutorial/csharp/CsharpClient/
thrift-0.9.1/tutorial/csharp/CsharpClient/CsharpClient.cs
thrift-0.9.1/tutorial/csharp/CsharpClient/CsharpClient.csproj
thrift-0.9.1/tutorial/csharp/CsharpClient/Properties/
thrift-0.9.1/tutorial/csharp/CsharpClient/Properties/AssemblyInfo.cs
thrift-0.9.1/tutorial/csharp/CsharpServer/
thrift-0.9.1/tutorial/csharp/CsharpServer/CsharpServer.cs
thrift-0.9.1/tutorial/csharp/CsharpServer/CsharpServer.csproj
thrift-0.9.1/tutorial/csharp/CsharpServer/Properties/
thrift-0.9.1/tutorial/csharp/CsharpServer/Properties/AssemblyInfo.cs
thrift-0.9.1/tutorial/csharp/tutorial.sln
thrift-0.9.1/tutorial/d/
thrift-0.9.1/tutorial/d/async_client.d
thrift-0.9.1/tutorial/d/client.d
thrift-0.9.1/tutorial/d/Makefile
thrift-0.9.1/tutorial/d/server.d
thrift-0.9.1/tutorial/delphi/
thrift-0.9.1/tutorial/delphi/DelphiClient/
thrift-0.9.1/tutorial/delphi/DelphiClient/DelphiClient.dpr
thrift-0.9.1/tutorial/delphi/DelphiClient/DelphiClient.dproj
thrift-0.9.1/tutorial/delphi/DelphiServer/
thrift-0.9.1/tutorial/delphi/DelphiServer/DelphiServer.dpr
thrift-0.9.1/tutorial/delphi/DelphiServer/DelphiServer.dproj
thrift-0.9.1/tutorial/delphi/Tutorial.groupproj
thrift-0.9.1/tutorial/erl/
thrift-0.9.1/tutorial/erl/client.erl
thrift-0.9.1/tutorial/erl/client.sh
thrift-0.9.1/tutorial/erl/json_client.erl
thrift-0.9.1/tutorial/erl/README
thrift-0.9.1/tutorial/erl/server.erl
thrift-0.9.1/tutorial/erl/server.sh
thrift-0.9.1/tutorial/gen-html/
thrift-0.9.1/tutorial/gen-html/index.html
thrift-0.9.1/tutorial/gen-html/shared.html
thrift-0.9.1/tutorial/gen-html/style.css
thrift-0.9.1/tutorial/gen-html/tutorial.html
thrift-0.9.1/tutorial/go/
thrift-0.9.1/tutorial/go/Makefile.am
thrift-0.9.1/tutorial/go/Makefile.in
thrift-0.9.1/tutorial/go/server.crt
thrift-0.9.1/tutorial/go/server.key
thrift-0.9.1/tutorial/go/src/
thrift-0.9.1/tutorial/go/src/client.go
thrift-0.9.1/tutorial/go/src/handler.go
thrift-0.9.1/tutorial/go/src/main.go
thrift-0.9.1/tutorial/go/src/server.go
thrift-0.9.1/tutorial/hs/
thrift-0.9.1/tutorial/hs/HaskellClient.hs
thrift-0.9.1/tutorial/hs/HaskellServer.hs
thrift-0.9.1/tutorial/hs/ThriftTutorial.cabal
thrift-0.9.1/tutorial/java/
thrift-0.9.1/tutorial/java/build.xml
thrift-0.9.1/tutorial/java/Makefile.am
thrift-0.9.1/tutorial/java/Makefile.in
thrift-0.9.1/tutorial/java/README
thrift-0.9.1/tutorial/java/src/
thrift-0.9.1/tutorial/java/src/CalculatorHandler.java
thrift-0.9.1/tutorial/java/src/JavaClient.java
thrift-0.9.1/tutorial/java/src/JavaServer.java
thrift-0.9.1/tutorial/js/
thrift-0.9.1/tutorial/js/build.xml
thrift-0.9.1/tutorial/js/Makefile.am
thrift-0.9.1/tutorial/js/Makefile.in
thrift-0.9.1/tutorial/js/src/
thrift-0.9.1/tutorial/js/src/Httpd.java
thrift-0.9.1/tutorial/js/tutorial.html
thrift-0.9.1/tutorial/Makefile.am
thrift-0.9.1/tutorial/Makefile.in
thrift-0.9.1/tutorial/ocaml/
thrift-0.9.1/tutorial/ocaml/_oasis
thrift-0.9.1/tutorial/ocaml/CalcClient.ml
thrift-0.9.1/tutorial/ocaml/CalcServer.ml
thrift-0.9.1/tutorial/ocaml/README
thrift-0.9.1/tutorial/perl/
thrift-0.9.1/tutorial/perl/PerlClient.pl
thrift-0.9.1/tutorial/perl/PerlServer.pl
thrift-0.9.1/tutorial/php/
thrift-0.9.1/tutorial/php/PhpClient.php
thrift-0.9.1/tutorial/php/PhpServer.php
thrift-0.9.1/tutorial/php/runserver.py
thrift-0.9.1/tutorial/py/
thrift-0.9.1/tutorial/py/Makefile.am
thrift-0.9.1/tutorial/py/Makefile.in
thrift-0.9.1/tutorial/py/PythonClient.py
thrift-0.9.1/tutorial/py/PythonServer.py
thrift-0.9.1/tutorial/py.tornado/
thrift-0.9.1/tutorial/py.tornado/Makefile.am
thrift-0.9.1/tutorial/py.tornado/Makefile.in
thrift-0.9.1/tutorial/py.tornado/PythonClient.py
thrift-0.9.1/tutorial/py.tornado/PythonServer.py
thrift-0.9.1/tutorial/py.twisted/
thrift-0.9.1/tutorial/py.twisted/Makefile.am
thrift-0.9.1/tutorial/py.twisted/Makefile.in
thrift-0.9.1/tutorial/py.twisted/PythonClient.py
thrift-0.9.1/tutorial/py.twisted/PythonServer.py
thrift-0.9.1/tutorial/py.twisted/PythonServer.tac
thrift-0.9.1/tutorial/rb/
thrift-0.9.1/tutorial/rb/Makefile.am
thrift-0.9.1/tutorial/rb/Makefile.in
thrift-0.9.1/tutorial/rb/RubyClient.rb
thrift-0.9.1/tutorial/rb/RubyServer.rb
thrift-0.9.1/tutorial/README
thrift-0.9.1/tutorial/shared.thrift
thrift-0.9.1/tutorial/tutorial.thrift
thrift-0.9.1/ylwrap
> Building 3% > :api:generateThriftJavamake[1]: Leaving directory `/dist/rpmbuild/BUILD/apache-aurora-0.17.0-SNAPSHOT/build-support/thrift'
> Building 3% > :api:generateThriftJavamake[1]: *** [thrift-0.9.1/compiler/cpp/thrift]
Error 1
:api:generateThriftJava FAILED

FAILURE: Build failed with an exception.

* What went wrong:
Execution failed for task ':api:generateThriftJava'.
> Process 'command '/dist/rpmbuild/BUILD/apache-aurora-0.17.0-SNAPSHOT/build-support/thrift/thriftw''
finished with non-zero exit value 2

* Try:
Run with --stacktrace option to get the stack trace. Run with --info or --debug option to
get more log output.

BUILD FAILED

Total time: 1 mins 7.368 secs
error: Bad exit status from /var/tmp/rpm-tmp.tTtymU (%build)


RPM build errors:
    bogus date in %changelog: Mon Jun 21 2016 Apache Aurora <dev@aurora.apache.org>
0.13.0-1.el7
    Bad exit status from /var/tmp/rpm-tmp.tTtymU (%build)
make: *** [rpm] Error 1
Build step 'Execute shell' marked build as failure
Skipped archiving because build is not successful

Mime
View raw message