aurora-dev mailing list archives

Site index · List index
Message view « Date » · « Thread »
Top « Date » · « Thread »
From "Erb, Stephan" <Stephan....@blue-yonder.com>
Subject Re: Build failed in Jenkins: aurora-packaging-nightly #535
Date Wed, 04 Jan 2017 15:02:27 GMT
I tried to investigate the repeated build failures of the Aurora packaging build job but was
not able to find the cause. Repeated builds on my local machine did not trigger the same error.


If anyone else has an idea what could be wrong with  https://builds.apache.org/view/All/job/aurora-packaging-nightly/
 please step forward.



On 04/01/2017, 01:38, "Apache Jenkins Server" <jenkins@builds.apache.org> wrote:

    See <https://builds.apache.org/job/aurora-packaging-nightly/535/>
    
    ------------------------------------------
    [...truncated 18959 lines...]
    failure
    failure_limit
    hello_world
    ordering
    ports
    sleep60
    
    artifacts/aurora-centos-7/dist/rpmbuild/BUILD/apache-aurora-0.17.0-SNAPSHOT/src/test/sh:
    org
    
    artifacts/aurora-centos-7/dist/rpmbuild/BUILD/apache-aurora-0.17.0-SNAPSHOT/src/test/sh/org:
    apache
    
    artifacts/aurora-centos-7/dist/rpmbuild/BUILD/apache-aurora-0.17.0-SNAPSHOT/src/test/sh/org/apache:
    aurora
    
    artifacts/aurora-centos-7/dist/rpmbuild/BUILD/apache-aurora-0.17.0-SNAPSHOT/src/test/sh/org/apache/aurora:
    e2e
    
    artifacts/aurora-centos-7/dist/rpmbuild/BUILD/apache-aurora-0.17.0-SNAPSHOT/src/test/sh/org/apache/aurora/e2e:
    Dockerfile.netcat
    Dockerfile.python
    ephemeral_daemon_with_final.aurora
    http
    http_example.py
    run-server.sh
    test_bypass_leader_redirect_end_to_end.sh
    test_daemonizing_process.aurora
    test_end_to_end.sh
    test_kerberos_end_to_end.sh
    validate_serverset.py
    
    artifacts/aurora-centos-7/dist/rpmbuild/BUILD/apache-aurora-0.17.0-SNAPSHOT/src/test/sh/org/apache/aurora/e2e/http:
    http_example.aurora
    http_example_bad_healthcheck.aurora
    http_example_updated.aurora
    
    artifacts/aurora-centos-7/dist/rpmbuild/BUILDROOT:
    
    artifacts/aurora-centos-7/dist/rpmbuild/RPMS:
    x86_64
    
    artifacts/aurora-centos-7/dist/rpmbuild/RPMS/x86_64:
    aurora-executor-0.17.0_SNAPSHOT.2016.12.12-1.el7.centos.aurora.x86_64.rpm
    aurora-executor-0.17.0_SNAPSHOT.2016.12.14-1.el7.centos.aurora.x86_64.rpm
    aurora-executor-0.17.0_SNAPSHOT.2016.12.15-1.el7.centos.aurora.x86_64.rpm
    aurora-executor-0.17.0_SNAPSHOT.2016.12.16-1.el7.centos.aurora.x86_64.rpm
    aurora-executor-0.17.0_SNAPSHOT.2016.12.26-1.el7.centos.aurora.x86_64.rpm
    aurora-executor-0.17.0_SNAPSHOT.2016.12.29-1.el7.centos.aurora.x86_64.rpm
    aurora-executor-0.17.0_SNAPSHOT.2017.01.03-1.el7.centos.aurora.x86_64.rpm
    aurora-scheduler-0.17.0_SNAPSHOT.2016.12.12-1.el7.centos.aurora.x86_64.rpm
    aurora-scheduler-0.17.0_SNAPSHOT.2016.12.14-1.el7.centos.aurora.x86_64.rpm
    aurora-scheduler-0.17.0_SNAPSHOT.2016.12.15-1.el7.centos.aurora.x86_64.rpm
    aurora-scheduler-0.17.0_SNAPSHOT.2016.12.16-1.el7.centos.aurora.x86_64.rpm
    aurora-scheduler-0.17.0_SNAPSHOT.2016.12.26-1.el7.centos.aurora.x86_64.rpm
    aurora-scheduler-0.17.0_SNAPSHOT.2016.12.29-1.el7.centos.aurora.x86_64.rpm
    aurora-scheduler-0.17.0_SNAPSHOT.2017.01.03-1.el7.centos.aurora.x86_64.rpm
    aurora-scheduler-debuginfo-0.17.0_SNAPSHOT.2016.12.12-1.el7.centos.aurora.x86_64.rpm
    aurora-scheduler-debuginfo-0.17.0_SNAPSHOT.2016.12.14-1.el7.centos.aurora.x86_64.rpm
    aurora-scheduler-debuginfo-0.17.0_SNAPSHOT.2016.12.15-1.el7.centos.aurora.x86_64.rpm
    aurora-scheduler-debuginfo-0.17.0_SNAPSHOT.2016.12.16-1.el7.centos.aurora.x86_64.rpm
    aurora-scheduler-debuginfo-0.17.0_SNAPSHOT.2016.12.26-1.el7.centos.aurora.x86_64.rpm
    aurora-scheduler-debuginfo-0.17.0_SNAPSHOT.2016.12.29-1.el7.centos.aurora.x86_64.rpm
    aurora-scheduler-debuginfo-0.17.0_SNAPSHOT.2017.01.03-1.el7.centos.aurora.x86_64.rpm
    aurora-tools-0.17.0_SNAPSHOT.2016.12.12-1.el7.centos.aurora.x86_64.rpm
    aurora-tools-0.17.0_SNAPSHOT.2016.12.14-1.el7.centos.aurora.x86_64.rpm
    aurora-tools-0.17.0_SNAPSHOT.2016.12.15-1.el7.centos.aurora.x86_64.rpm
    aurora-tools-0.17.0_SNAPSHOT.2016.12.16-1.el7.centos.aurora.x86_64.rpm
    aurora-tools-0.17.0_SNAPSHOT.2016.12.26-1.el7.centos.aurora.x86_64.rpm
    aurora-tools-0.17.0_SNAPSHOT.2016.12.29-1.el7.centos.aurora.x86_64.rpm
    aurora-tools-0.17.0_SNAPSHOT.2017.01.03-1.el7.centos.aurora.x86_64.rpm
    repodata
    
    artifacts/aurora-centos-7/dist/rpmbuild/RPMS/x86_64/repodata:
    077b3c5c12e5bc075694b4fc884b503e4167dcabba4502bdd72715cc1a464d7a-other.sqlite.bz2
    162ac872fa2d3fde308a44e8617eb9a74a9649a0f4a09db1a8103033c4bf8dc9-primary.xml.gz
    1bba22db0bdc1c51d165a9562d8c2a369ec0361b494e80ee51231e64283be84a-primary.sqlite.bz2
    20ebec8dede455208f21767f897788be4cb2ff4465d63c62276d578e3497c337-other.xml.gz
    22e71dace89c0e45d4fcb3afc6f805973d8b6a4e8400217f3e2d099cad2e4742-primary.xml.gz
    247cc5d9118a98da934750f93ac1a03c39f9ee5e21ffb1f76cfea1ff6c01844b-filelists.xml.gz
    262601e2b003888bdc9849b10e5aeac215981e64a4bedf3e07fb19d32a0e4f11-filelists.xml.gz
    2c8f782d7e0a79c7971e4c0bcbe14260c298cfad7e84a963d598855b06cbace9-filelists.xml.gz
    342e34595dc31e041d531998d6d389177eba7a8e3f103a289473d6a4f5536537-primary.xml.gz
    3519d0119d149a55c322bcd541ab2c0b2f06bc18510bcacab5f0b980601ac42f-primary.sqlite.bz2
    3b4652197f044b1879dd319eda0d9cfc590cf00b2a6ccadf54bb1509d5ab709b-other.xml.gz
    3bf92a06d79595a58968cd3533761137f9934b250094c5d782c9b3b74e1801fd-primary.sqlite.bz2
    3bfed320d3b15283f1cc2c8325b2fba6de6a0de1116fe99dec4f8d47fc40e31e-other.sqlite.bz2
    4de8420a2ef3b9f01c0b0863e9d22ee93186d0835f5b49eb1a53041c1c7811df-filelists.xml.gz
    64193065a694f663013283242bab778d9f9255710e9328a53f84631b00050c79-other.sqlite.bz2
    664121e48cdb68f89edd8b2422bc080373ebd1d28391efe05d4d6cccf9cf36ec-primary.xml.gz
    700278d857fc77dc1d705301eaba7808e3c76535077a549415e55465e5cd1d4f-filelists.sqlite.bz2
    7169a84c3537f7407605a07f2b371c36b158f9eb9587be39073f5fb6904b918e-other.sqlite.bz2
    74ae0348c60e333fb822976d9734a9359aa4ef57771ccda9a7c65fd533ce5780-other.xml.gz
    776665cdba29e61f3481693ea02307fc24f6dee8d5a4514fbbbd3224c332aee6-primary.sqlite.bz2
    8e43c41afee0b4078ae6b60f69902c5df4f30ab8b0498a7dc484ca050505a3dd-other.sqlite.bz2
    9942ec2c7344a5eb76d533cda728a58e5681311a844dba66e05e6ca0ded4520e-filelists.sqlite.bz2
    9f4c741330be7009766ece6d6edc325e169bb1d513fe0355682180fef46556ec-primary.sqlite.bz2
    a02548d38ee53af4ab1af6e404a0cfdcc92839fe4c0b6464d18a56f9b32688cc-filelists.xml.gz
    a3e9e4ba1fe6dcc136d379c7a59f2ab836019888a50b7e32d40b1bdd585f61a0-filelists.sqlite.bz2
    a50a64d8886f26301699289ed75611f25dc1384255090e4f9bb1878ac4b1d4a0-other.xml.gz
    b5f7b2ca84cc3b8bfae9f3e5d449eb31ad188fcbb1f5bc7f800384f093b028d7-primary.xml.gz
    ba6be8f218f8350a0d2af717a035a4aaf3be325bcdf367f4a906cf94e32329cb-primary.xml.gz
    c325a600fc8ae7f6b533e94b29ab0caa2b78a3ab8c805203404c519f44d58e2e-primary.xml.gz
    c3c1a270250b375a3e30fc13a9a0b610475ee9465ae2dd223c6cee8792ceacab-other.xml.gz
    c7f8e160a8137e347f19c13217b1400586250f56537c8166e8248df75eb5876a-primary.sqlite.bz2
    ca9ed0fb9210ad532092c65135f2febdb8e216e97cb025c3f8e9ab28f9729dc0-filelists.xml.gz
    d806f8bfa70a1fec2a21ef9f1be29df22688ded4122814a64378c605c0f83cbe-other.xml.gz
    d8899a8f829632b099e49c06c1ab4ec63b67fd0e2e97fa610f4d234aa7f865ad-primary.sqlite.bz2
    ddeb55e2cf86d608ffb3bf3e537530971211e34cd14227ec2dc76fd2dc47ebdc-filelists.xml.gz
    e58f0586de6d11965d0c8c2634f565a20b58e850e43b988580fa73b7d84a2778-filelists.sqlite.bz2
    e7624a9465dd49154199782b3b053f885a7b578ed2b9e38e20e0e13af8424339-filelists.sqlite.bz2
    ea75f56a81727ca3c9acc4554b75424bacf4a8cb5e8c30b5d8216aeeef8954bd-other.xml.gz
    f045d30b96306ebb0d6d1e23dae70933f07143149fc8282ac36a2e028e168e7d-filelists.sqlite.bz2
    f90f06481eb740778340d4ce61aa3e08ab2aa138acd4f03d5926c0f5f12d9b67-other.sqlite.bz2
    fe2215422d6bd2f7b7e9616e336553d230d43fe16ff85ddc52c310f116637117-other.sqlite.bz2
    ff6adda682436c09c9dc153d8b7209a3700015f4e1189eca769c55015fd555ab-filelists.sqlite.bz2
    repomd.xml
    
    artifacts/aurora-centos-7/dist/rpmbuild/SOURCES:
    apache-aurora-0.17.0_SNAPSHOT.2016.12.12.tar.gz
    apache-aurora-0.17.0_SNAPSHOT.2016.12.14.tar.gz
    apache-aurora-0.17.0_SNAPSHOT.2016.12.15.tar.gz
    apache-aurora-0.17.0_SNAPSHOT.2016.12.16.tar.gz
    apache-aurora-0.17.0_SNAPSHOT.2016.12.26.tar.gz
    apache-aurora-0.17.0_SNAPSHOT.2016.12.29.tar.gz
    apache-aurora-0.17.0_SNAPSHOT.2017.01.03.tar.gz
    aurora-pants.ini
    aurora-scheduler.init.sh
    aurora-scheduler.logrotate
    aurora-scheduler.service
    aurora-scheduler.startup.sh
    aurora-scheduler.sysconfig
    clusters.json
    thermos.init.sh
    thermos.logrotate
    thermos.service
    thermos.startup.sh
    thermos.sysconfig
    
    artifacts/aurora-centos-7/dist/rpmbuild/SRPMS:
    aurora-scheduler-0.17.0_SNAPSHOT.2016.12.12-1.el7.centos.aurora.src.rpm
    aurora-scheduler-0.17.0_SNAPSHOT.2016.12.14-1.el7.centos.aurora.src.rpm
    aurora-scheduler-0.17.0_SNAPSHOT.2016.12.15-1.el7.centos.aurora.src.rpm
    aurora-scheduler-0.17.0_SNAPSHOT.2016.12.16-1.el7.centos.aurora.src.rpm
    aurora-scheduler-0.17.0_SNAPSHOT.2016.12.26-1.el7.centos.aurora.src.rpm
    aurora-scheduler-0.17.0_SNAPSHOT.2016.12.29-1.el7.centos.aurora.src.rpm
    aurora-scheduler-0.17.0_SNAPSHOT.2017.01.03-1.el7.centos.aurora.src.rpm
    builder/rpm/centos-7
    Using docker image aurora-ubuntu-trusty
    Sending build context to Docker daemon  5.12 kB
    
    Step 1 : FROM ubuntu:trusty
     ---> 4d44acee901c
    Step 2 : WORKDIR /aurora
     ---> Using cache
     ---> 557cc5655380
    Step 3 : ENV HOME /aurora
     ---> Using cache
     ---> 1a9cbb986346
    Step 4 : ENV DEBIAN_FRONTEND noninteractive
     ---> Using cache
     ---> 1eb0004c27dc
    Step 5 : RUN apt-get update && apt-get -y install   bison   debhelper   devscripts
  dpkg-dev   curl   git   libapr1-dev   libcurl4-openssl-dev   libffi-dev   libsvn-dev   python-all-dev
  software-properties-common
     ---> Using cache
     ---> 5bbd9834c78c
    Step 6 : RUN add-apt-repository -y ppa:openjdk-r/ppa   && apt-get update   &&
apt-get -y install openjdk-8-jdk   && update-alternatives --set java /usr/lib/jvm/java-8-openjdk-amd64/jre/bin/java
     ---> Using cache
     ---> 21e80f1fa477
    Step 7 : RUN curl -sSL http://apache.org/dist/thrift/KEYS | gpg --import - &&
   gpg --export --armor 66B778F9 | sudo apt-key add - &&    echo 'deb http://www.apache.org/dist/thrift/debian
0.9.1 main' > /etc/apt/sources.list.d/thrift.list &&    apt-get update &&
   apt-get -y install thrift-compiler=0.9.1
     ---> Using cache
     ---> 51e1f3e7b5f7
    Step 8 : RUN git clone --depth 1 https://github.com/benley/gradle-packaging   &&
cd gradle-packaging   && apt-get -y install ruby ruby-dev unzip wget   &&
gem install fpm && ./gradle-mkdeb.sh 3.1   && apt-get -y install gdebi-core
  && gdebi --non-interactive gradle-3.1_3.1-2_all.deb   && cd .. &&
rm -rf gradle-packaging
     ---> Using cache
     ---> d88faa8f23a9
    Step 9 : ADD build.sh /build.sh
     ---> Using cache
     ---> fd239dcc916f
    Successfully built fd239dcc916f
    + mkdir /scratch
    + cd /scratch
    + tar --strip-components 1 -C . -xf /src.tar.gz
    + cp -R /specs/debian .
    + export 'DEBFULLNAME=Apache Aurora'
    + DEBFULLNAME='Apache Aurora'
    + export DEBEMAIL=dev@aurora.apache.org
    + DEBEMAIL=dev@aurora.apache.org
    ++ date -R
    + dch --newversion 0.17.0-SNAPSHOT.2017.01.03 --package apache-aurora --urgency medium
'Apache Aurora package builder <dev@aurora.apache.org> Tue, 03 Jan 2017 23:54:14 +0000'
    dch warning: Previous package version was Debian native whilst new version is not
    + dch --release ''
    + dpkg-buildpackage -uc -b -tc
    dpkg-buildpackage: source package apache-aurora
    dpkg-buildpackage: source version 0.17.0-SNAPSHOT.2017.01.03
    dpkg-buildpackage: source distribution trusty
    dpkg-buildpackage: source changed by Apache Aurora <dev@aurora.apache.org>
    dpkg-buildpackage: host architecture amd64
     dpkg-source --before-build scratch
     debian/rules clean
    dh clean --exclude=aurora-scheduler.bat
       dh_testdir -O--exclude=aurora-scheduler.bat
       dh_auto_clean -O--exclude=aurora-scheduler.bat
       dh_clean -O--exclude=aurora-scheduler.bat
     debian/rules build
    dh build --exclude=aurora-scheduler.bat
       dh_testdir -O--exclude=aurora-scheduler.bat
       dh_auto_configure -O--exclude=aurora-scheduler.bat
       debian/rules override_dh_auto_build
    make[1]: Entering directory `/scratch'
    /usr/bin/gradle installDist
    Starting a Gradle Daemon (subsequent builds will be faster)
    > Starting Daemon> Starting Daemon > Connecting to Daemon> LoadingInvalidating
buildSrc state cache (/scratch/buildSrc/.gradle/noVersion/buildSrc) as it was not closed cleanly.
    > Loading > buildSrc > settings> Loading > buildSrc> Loading > buildSrc
> Compiling jar:file:/opt/gradle-3.1/lib/gradle-core-3.1.jar!/org/gradle/initialization/buildsrc/defaultBuildSourceScript.txt
into local build cache> Loading > buildSrc > Compiling jar:file:/opt/gradle-3.1/lib/gradle-core-3.1.jar!/org/gradle/initialization/buildsrc/defaultBuildSourceScript.txt
into local build cache > Compiling script 'jar:file:/opt/gradle-3.1/lib/gradle-core-3.1.jar!/org/gradle/initialization/buildsrc/defaultBuildSourceScript.txt'
to cross build script cache> Loading > buildSrc > Compiling jar:file:/opt/gradle-3.1/lib/gradle-core-3.1.jar!/org/gradle/initialization/buildsrc/defaultBuildSourceScript.txt
into local build cache> Loading > buildSrcGenerating JAR file 'gradle-api-3.1.jar'
    > Loading > buildSrc> Loading > buildSrc > Generating 0%> Loading >
buildSrc > Generating 1%> Loading > buildSrc > Generating 2%> Loading >
buildSrc > Generating 3%> Loading > buildSrc > Generating 4%> Loading >
buildSrc > Generating 9%> Loading > buildSrc > Generating 20%> Loading >
buildSrc > Generating 25%> Loading > buildSrc > Generating 26%> Loading >
buildSrc > Generating 27%> Loading > buildSrc > Generating 29%> Loading >
buildSrc > Generating 34%> Loading > buildSrc > Generating 38%> Loading >
buildSrc > Generating 41%> Loading > buildSrc > Generating 45%> Loading >
buildSrc > Generating 47%> Loading > buildSrc > Generating 49%> Loading >
buildSrc > Generating 50%> Loading > buildSrc > Generating 51%> Loading >
buildSrc > Generating 52%> Loading > buildSrc > Generating 56%> Loading >
buildSrc > Generating 58%> Loading > buildSrc > Generating 62%> Loading >
buildSrc > Generating 63%> Loading > buildSrc > Generating 64%> Loading >
buildSrc > Generating 67%> Loading > buildSrc > Generating 69%> Loading >
buildSrc > Generating 70%> Loading > buildSrc > Generating 75%> Loading >
buildSrc > Generating 76%> Loading > buildSrc > Generating 77%> Loading >
buildSrc > Generating 79%> Loading > buildSrc > Generating 84%> Loading >
buildSrc > Generating 85%> Loading > buildSrc > Generating 87%> Loading >
buildSrc > Generating 88%> Loading > buildSrc > Generating 92%> Loading >
buildSrc > Generating 94%> Loading > buildSrc > Generating 96%> Loading >
buildSrc > Generating 100%                                        
    > Loading > buildSrc> Loading > buildSrc > Compiling /scratch/buildSrc/build.gradle
into local build cache> Loading > buildSrc > Compiling /scratch/buildSrc/build.gradle
into local build cache > Compiling build file '/scratch/buildSrc/build.gradle' to cross
build script cache> Loading > buildSrc > Compiling /scratch/buildSrc/build.gradle
into local build cache> Loading > buildSrc > Resolving dependencies ':runtime'>
Loading > buildSrc:buildSrc:clean UP-TO-DATE
    :buildSrc:compileJava UP-TO-DATE
    > Loading > buildSrc > :buildSrc:compileGroovy:buildSrc:compileGroovy
    > Loading > buildSrc:buildSrc:processResources UP-TO-DATE
    :buildSrc:classes
    :buildSrc:jar
    :buildSrc:assemble
    :buildSrc:compileTestJava UP-TO-DATE
    :buildSrc:compileTestGroovy UP-TO-DATE
    :buildSrc:processTestResources UP-TO-DATE
    :buildSrc:testClasses UP-TO-DATE
    :buildSrc:test UP-TO-DATE
    :buildSrc:check UP-TO-DATE
    :buildSrc:build
    > Loading > buildSrc> Configuring > 0/5 projects > root project > Compiling
/scratch/build.gradle into local build cache > Compiling build file '/scratch/build.gradle'
to cross build script cache> Configuring > 0/5 projects > root project > Compiling
/scratch/build.gradle into local build cache> Configuring > 0/5 projects > root project
    FAILURE: Build failed with an exception.
    
    * Where:
    Build file '/scratch/build.gradle' line: 18
    
    * What went wrong:
    Error resolving plugin [id: 'com.eriwen.gradle.js', version: '1.12.1']
    > org.apache.http.ssl.SSLInitializationException: /usr/lib/jvm/java-8-openjdk-amd64/jre/lib/security/cacerts
(No such file or directory)
    
    * Try:
    Run with --stacktrace option to get the stack trace. Run with --info or --debug option
to get more log output.
    
    BUILD FAILED
    
    Total time: 16.531 secs
    make[1]: *** [__gradle_build] Error 1
    make[1]: Leaving directory `/scratch'
    make: *** [build] Error 2
    dpkg-buildpackage: error: debian/rules build gave error exit status 2
    Build step 'Execute shell' marked build as failure
    Skipped archiving because build is not successful
    

Mime
View raw message