aurora-dev mailing list archives

Site index · List index
Message view « Date » · « Thread »
Top « Date » · « Thread »
From Apache Jenkins Server <jenk...@builds.apache.org>
Subject Build failed in Jenkins: aurora-packaging-nightly #553
Date Sun, 22 Jan 2017 00:54:00 GMT
See <https://builds.apache.org/job/aurora-packaging-nightly/553/>

------------------------------------------
[...truncated 32982 lines...]
  
Building data structures... 95%
  
Building data structures... 95%
  
Building data structures... 95%
  
Building data structures... 95%
  
Building data structures... 95%
  
Building data structures... 95%
  
Building data structures... 96%
  
Building data structures... 96%
  
Building data structures... 96%
  
Building data structures... 96%
  
Building data structures... 96%
  
Building data structures... 96%
  
Building data structures... 97%
  
Building data structures... 97%
  
Building data structures... 97%
  
Building data structures... 97%
  
Building data structures... 97%
  
Building data structures... 97%
  
Building data structures... 98%
  
Building data structures... 98%
  
Building data structures... 98%
  
Building data structures... 98%
  
Building data structures... 98%
  
Building data structures... 99%
  
Building data structures... 99%
  
Building data structures... 99%
  
Building data structures... 99%
  
Building data structures... 99%
  
Building data structures... 99%
  

Building data structures... Done 

Building data structures... 0%
   
Building data structures... 1%
   
Building data structures... 3%
   
Building data structures... 5%
   
Building data structures... 7%
   
Building data structures... 9%
   
Building data structures... 11%
  
Building data structures... 13%
  
Building data structures... 15%
  
Building data structures... 17%
  
Building data structures... 19%
  
Building data structures... 21%
  
Building data structures... 23%
  
Building data structures... 25%
  
Building data structures... 27%
  
Building data structures... 29%
  
Building data structures... 31%
  
Building data structures... 33%
  
Building data structures... 35%
  
Building data structures... 37%
  
Building data structures... 39%
  
Building data structures... 41%
  
Building data structures... 43%
  
Building data structures... 45%
  
Building data structures... 47%
  
Building data structures... 49%
  
Building data structures... 51%
  
Building data structures... 53%
  
Building data structures... 55%
  
Building data structures... 57%
  
Building data structures... 59%
  
Building data structures... 61%
  
Building data structures... 63%
  
Building data structures... 65%
  
Building data structures... 67%
  
Building data structures... 69%
  
Building data structures... 71%
  
Building data structures... 73%
  
Building data structures... 75%
  
Building data structures... 77%
  
Building data structures... 79%
  
Building data structures... 81%
  
Building data structures... 83%
  
Building data structures... 85%
  
Building data structures... 87%
  
Building data structures... 89%
  
Building data structures... 91%
  
Building data structures... 93%
  
Building data structures... 95%
  
Building data structures... 97%
  
Building data structures... 99%
  Selecting previously unselected package gradle-3.1.
(Reading database ... 33573 files and directories currently installed.)
Preparing to unpack gradle-3.1_3.1-2_all.deb ...
Unpacking gradle-3.1 (3.1-2) ...
Setting up gradle-3.1 (3.1-2) ...
update-alternatives: using /opt/gradle-3.1/bin/gradle to provide /usr/bin/gradle (gradle)
in auto mode


Building data structures... Done 
 ---> 40954bf7c8c7
Removing intermediate container 172684ac10e0
Step 9 : ADD build.sh /build.sh
 ---> 264bfdcd4dd7
Removing intermediate container 5a3678039930
Successfully built 264bfdcd4dd7
+ mkdir /scratch
+ cd /scratch
+ tar --strip-components 1 -C . -xf /src.tar.gz
+ cp -R /specs/debian .
+ export 'DEBFULLNAME=Apache Aurora'
+ DEBFULLNAME='Apache Aurora'
+ export DEBEMAIL=dev@aurora.apache.org
+ DEBEMAIL=dev@aurora.apache.org
++ date -R
+ dch --newversion 0.17.0-SNAPSHOT.2017.01.22 --package apache-aurora --urgency medium 'Apache
Aurora package builder <dev@aurora.apache.org> Sun, 22 Jan 2017 00:53:39 +0000'
dch warning: Previous package version was Debian native whilst new version is not
+ dch --release ''
+ dpkg-buildpackage -uc -b -tc
dpkg-buildpackage: source package apache-aurora
dpkg-buildpackage: source version 0.17.0-SNAPSHOT.2017.01.22
dpkg-buildpackage: source distribution trusty
dpkg-buildpackage: source changed by Apache Aurora <dev@aurora.apache.org>
dpkg-buildpackage: host architecture amd64
 dpkg-source --before-build scratch
 debian/rules clean
dh clean --exclude=aurora-scheduler.bat
   dh_testdir -O--exclude=aurora-scheduler.bat
   dh_auto_clean -O--exclude=aurora-scheduler.bat
   dh_clean -O--exclude=aurora-scheduler.bat
 debian/rules build
dh build --exclude=aurora-scheduler.bat
   dh_testdir -O--exclude=aurora-scheduler.bat
   dh_auto_configure -O--exclude=aurora-scheduler.bat
   debian/rules override_dh_auto_build
make[1]: Entering directory `/scratch'
/usr/bin/gradle installDist
Starting a Gradle Daemon (subsequent builds will be faster)
> Starting Daemon> Starting Daemon > Connecting to Daemon> LoadingInvalidating
buildSrc state cache (/scratch/buildSrc/.gradle/noVersion/buildSrc) as it was not closed cleanly.
> Loading > buildSrc > settings> Loading > buildSrc> Loading > buildSrc
> Compiling jar:file:/opt/gradle-3.1/lib/gradle-core-3.1.jar!/org/gradle/initialization/buildsrc/defaultBuildSourceScript.txt
into local build cache> Loading > buildSrc > Compiling jar:file:/opt/gradle-3.1/lib/gradle-core-3.1.jar!/org/gradle/initialization/buildsrc/defaultBuildSourceScript.txt
into local build cache > Compiling script 'jar:file:/opt/gradle-3.1/lib/gradle-core-3.1.jar!/org/gradle/initialization/buildsrc/defaultBuildSourceScript.txt'
to cross build script cache> Loading > buildSrc > Compiling jar:file:/opt/gradle-3.1/lib/gradle-core-3.1.jar!/org/gradle/initialization/buildsrc/defaultBuildSourceScript.txt
into local build cache> Loading > buildSrcGenerating JAR file 'gradle-api-3.1.jar'
> Loading > buildSrc> Loading > buildSrc > Generating 0%> Loading > buildSrc
> Generating 1%> Loading > buildSrc > Generating 2%> Loading > buildSrc
> Generating 3%> Loading > buildSrc > Generating 4%> Loading > buildSrc
> Generating 9%> Loading > buildSrc > Generating 10%> Loading > buildSrc
> Generating 20%> Loading > buildSrc > Generating 25%> Loading > buildSrc
> Generating 26%> Loading > buildSrc > Generating 27%> Loading > buildSrc
> Generating 29%> Loading > buildSrc > Generating 36%> Loading > buildSrc
> Generating 40%> Loading > buildSrc > Generating 44%> Loading > buildSrc
> Generating 47%> Loading > buildSrc > Generating 48%> Loading > buildSrc
> Generating 49%> Loading > buildSrc > Generating 50%> Loading > buildSrc
> Generating 51%> Loading > buildSrc > Generating 52%> Loading > buildSrc
> Generating 55%> Loading > buildSrc > Generating 58%> Loading > buildSrc
> Generating 62%> Loading > buildSrc > Generating 63%> Loading > buildSrc
> Generating 64%> Loading > buildSrc > Generating 67%> Loading > buildSrc
> Generating 69%> Loading > buildSrc > Generating 70%> Loading > buildSrc
> Generating 74%> Loading > buildSrc > Generating 76%> Loading > buildSrc
> Generating 77%> Loading > buildSrc > Generating 79%> Loading > buildSrc
> Generating 84%> Loading > buildSrc > Generating 85%> Loading > buildSrc
> Generating 87%> Loading > buildSrc > Generating 88%> Loading > buildSrc
> Generating 89%> Loading > buildSrc > Generating 90%> Loading > buildSrc
> Generating 93%> Loading > buildSrc > Generating 94%> Loading > buildSrc
> Generating 96%> Loading > buildSrc > Generating 100%                       
                
> Loading > buildSrc> Loading > buildSrc > Compiling /scratch/buildSrc/build.gradle
into local build cache > Compiling build file '/scratch/buildSrc/build.gradle' to cross
build script cache> Loading > buildSrc > Compiling /scratch/buildSrc/build.gradle
into local build cache> Loading > buildSrc > Resolving dependencies ':runtime'>
Loading > buildSrc:buildSrc:clean UP-TO-DATE
:buildSrc:compileJava UP-TO-DATE
> Loading > buildSrc > :buildSrc:compileGroovy:buildSrc:compileGroovy
> Loading > buildSrc:buildSrc:processResources UP-TO-DATE
:buildSrc:classes
:buildSrc:jar
:buildSrc:assemble
:buildSrc:compileTestJava UP-TO-DATE
:buildSrc:compileTestGroovy UP-TO-DATE
:buildSrc:processTestResources UP-TO-DATE
> Loading > buildSrc > :buildSrc:testClasses:buildSrc:testClasses UP-TO-DATE
:buildSrc:test UP-TO-DATE
:buildSrc:check UP-TO-DATE
:buildSrc:build
> Loading > settings > Compiling /scratch/settings.gradle into local build cache>
Configuring > 0/5 projects > root project > Compiling /scratch/build.gradle into
local build cache > Compiling build file '/scratch/build.gradle' to cross build script
cache> Configuring > 0/5 projects > root project > Compiling /scratch/build.gradle
into local build cache> Configuring > 0/5 projects > root project
FAILURE: Build failed with an exception.

* Where:
Build file '/scratch/build.gradle' line: 18

* What went wrong:
Error resolving plugin [id: 'com.eriwen.gradle.js', version: '1.12.1']
> org.apache.http.ssl.SSLInitializationException: /usr/lib/jvm/java-8-openjdk-amd64/jre/lib/security/cacerts
(No such file or directory)

* Try:
Run with --stacktrace option to get the stack trace. Run with --info or --debug option to
get more log output.

BUILD FAILED

Total time: 17.319 secs
make[1]: *** [__gradle_build] Error 1
make[1]: Leaving directory `/scratch'
make: *** [build] Error 2
dpkg-buildpackage: error: debian/rules build gave error exit status 2
Build step 'Execute shell' marked build as failure
Skipped archiving because build is not successful

Mime
View raw message