aurora-dev mailing list archives

Site index · List index
Message view « Date » · « Thread »
Top « Date » · « Thread »
From Apache Jenkins Server <jenk...@builds.apache.org>
Subject Build failed in Jenkins: aurora-packaging-nightly #532
Date Sun, 01 Jan 2017 00:31:58 GMT
See <https://builds.apache.org/job/aurora-packaging-nightly/532/>

------------------------------------------
Started by timer
[EnvInject] - Loading node environment variables.
Building remotely on H11 (ubuntu) in workspace <https://builds.apache.org/job/aurora-packaging-nightly/ws/>
 > git rev-parse --is-inside-work-tree # timeout=10
Fetching changes from the remote Git repository
 > git config remote.origin.url https://git-wip-us.apache.org/repos/asf/aurora # timeout=10
Fetching upstream changes from https://git-wip-us.apache.org/repos/asf/aurora
 > git --version # timeout=10
 > git -c core.askpass=true fetch --tags --progress https://git-wip-us.apache.org/repos/asf/aurora
+refs/heads/*:refs/remotes/origin/* --depth=1
 > git rev-parse refs/remotes/origin/master^{commit} # timeout=10
 > git rev-parse refs/remotes/origin/origin/master^{commit} # timeout=10
Checking out Revision 21ad18ec7e6b7104714b97c5d3348f7f2e97fc0a (refs/remotes/origin/master)
 > git config core.sparsecheckout # timeout=10
 > git checkout -f 21ad18ec7e6b7104714b97c5d3348f7f2e97fc0a
 > git rev-list 21ad18ec7e6b7104714b97c5d3348f7f2e97fc0a # timeout=10
 > git rev-parse --is-inside-work-tree # timeout=10
Fetching changes from the remote Git repository
 > git config remote.origin.url https://git-wip-us.apache.org/repos/asf/aurora-packaging
# timeout=10
Fetching upstream changes from https://git-wip-us.apache.org/repos/asf/aurora-packaging
 > git --version # timeout=10
 > git -c core.askpass=true fetch --tags --progress https://git-wip-us.apache.org/repos/asf/aurora-packaging
+refs/heads/*:refs/remotes/origin/*
 > git rev-parse refs/remotes/origin/master^{commit} # timeout=10
 > git rev-parse refs/remotes/origin/origin/master^{commit} # timeout=10
Checking out Revision 9f91188587a0f3d358b171a9f4470b3d86d71576 (refs/remotes/origin/master)
 > git config core.sparsecheckout # timeout=10
 > git checkout -f 9f91188587a0f3d358b171a9f4470b3d86d71576
 > git rev-list 9f91188587a0f3d358b171a9f4470b3d86d71576 # timeout=10
[aurora-packaging-nightly] $ /bin/bash -xe /tmp/hudson8267839506565113466.sh
+ cd aurora
++ cat .auroraversion
+ internal_version=0.17.0-SNAPSHOT
+ git archive --prefix=apache-aurora-0.17.0-SNAPSHOT/ -o snapshot.tar.gz HEAD
+ cd ../aurora-packaging
++ date +%Y.%m.%d
+ nightly_version=0.17.0-SNAPSHOT.2017.01.01
+ ./build-artifact.sh ../aurora/snapshot.tar.gz 0.17.0-SNAPSHOT.2017.01.01
Using docker image aurora-debian-jessie
Sending build context to Docker daemon  5.12 kB

Step 1 : FROM debian:jessie
 ---> ddf73f48a05d
Step 2 : WORKDIR /aurora
 ---> Using cache
 ---> 853338d6bded
Step 3 : ENV HOME /aurora
 ---> Using cache
 ---> 480520c81371
Step 4 : ENV DEBIAN_FRONTEND noninteractive
 ---> Using cache
 ---> 8c53aa222dc4
Step 5 : RUN echo    'deb http://mirrors.kernel.org/debian/ jessie main\n     deb http://mirrors.kernel.org/debian/
jessie-updates main\n     deb http://mirrors.kernel.org/debian/ jessie-backports main\n  
  deb http://security.debian.org jessie/updates main\n'     > /etc/apt/sources.list
 ---> Using cache
 ---> d74686390cd2
Step 6 : RUN apt-get update && apt-get -y install   bison   debhelper   devscripts
  dpkg-dev   curl   git   libapr1-dev   libcurl4-openssl-dev   libffi-dev   libkrb5-dev  
libsvn-dev   python-all-dev   software-properties-common   thrift-compiler
 ---> Using cache
 ---> f4c04f712073
Step 7 : RUN apt-get -y -t jessie-backports install openjdk-8-jdk    && update-alternatives
--set java /usr/lib/jvm/java-8-openjdk-amd64/jre/bin/java
 ---> Using cache
 ---> 8334a7e387ec
Step 8 : RUN git clone --depth 1 https://github.com/benley/gradle-packaging   && cd
gradle-packaging   && apt-get -y install ruby ruby-dev unzip wget   && gem
install fpm && ./gradle-mkdeb.sh 3.1   && apt-get -y install gdebi-core  
&& gdebi --non-interactive gradle-3.1_3.1-2_all.deb   && cd .. &&
rm -rf gradle-packaging
 ---> Using cache
 ---> beedbf2483de
Step 9 : ADD build.sh /build.sh
 ---> Using cache
 ---> c7af82413acb
Successfully built c7af82413acb
+ mkdir /scratch
+ cd /scratch
+ tar --strip-components 1 -C . -xf /src.tar.gz
+ cp -R /specs/debian .
+ export 'DEBFULLNAME=Apache Aurora'
+ DEBFULLNAME='Apache Aurora'
+ export DEBEMAIL=dev@aurora.apache.org
+ DEBEMAIL=dev@aurora.apache.org
++ date -R
+ dch --newversion 0.17.0-SNAPSHOT.2017.01.01 --package apache-aurora --urgency medium 'Apache
Aurora package builder <dev@aurora.apache.org> Sun, 01 Jan 2017 00:30:08 +0000'
dch warning: Previous package version was Debian native whilst new version is not
+ dch --release ''
+ dpkg-buildpackage -uc -b -tc
dpkg-buildpackage: source package apache-aurora
dpkg-buildpackage: source version 0.17.0-SNAPSHOT.2017.01.01
dpkg-buildpackage: source distribution trusty
dpkg-buildpackage: source changed by Apache Aurora <dev@aurora.apache.org>
dpkg-buildpackage: host architecture amd64
 dpkg-source --before-build scratch
 debian/rules clean
dh clean --exclude=aurora-scheduler.bat
   dh_testdir -O--exclude=aurora-scheduler.bat
   dh_auto_clean -O--exclude=aurora-scheduler.bat
   dh_clean -O--exclude=aurora-scheduler.bat
 debian/rules build
dh build --exclude=aurora-scheduler.bat
   dh_testdir -O--exclude=aurora-scheduler.bat
   dh_auto_configure -O--exclude=aurora-scheduler.bat
   debian/rules override_dh_auto_build
make[1]: Entering directory '/scratch'
/usr/bin/gradle installDist
Starting a Gradle Daemon (subsequent builds will be faster)
> Starting Daemon> Starting Daemon > Connecting to Daemon> LoadingInvalidating
buildSrc state cache (/scratch/buildSrc/.gradle/noVersion/buildSrc) as it was not closed cleanly.
> Loading > buildSrc > settings> Loading > buildSrc> Loading > buildSrc
> Compiling jar:file:/opt/gradle-3.1/lib/gradle-core-3.1.jar!/org/gradle/initialization/buildsrc/defaultBuildSourceScript.txt
into local build cache> Loading > buildSrc > Compiling jar:file:/opt/gradle-3.1/lib/gradle-core-3.1.jar!/org/gradle/initialization/buildsrc/defaultBuildSourceScript.txt
into local build cache > Compiling script 'jar:file:/opt/gradle-3.1/lib/gradle-core-3.1.jar!/org/gradle/initialization/buildsrc/defaultBuildSourceScript.txt'
to cross build script cache> Loading > buildSrc > Compiling jar:file:/opt/gradle-3.1/lib/gradle-core-3.1.jar!/org/gradle/initialization/buildsrc/defaultBuildSourceScript.txt
into local build cache> Loading > buildSrcGenerating JAR file 'gradle-api-3.1.jar'
> Loading > buildSrc> Loading > buildSrc > Generating 0%> Loading > buildSrc
> Generating 1%> Loading > buildSrc > Generating 2%> Loading > buildSrc
> Generating 3%> Loading > buildSrc > Generating 4%> Loading > buildSrc
> Generating 8%> Loading > buildSrc > Generating 9%> Loading > buildSrc
> Generating 19%> Loading > buildSrc > Generating 20%> Loading > buildSrc
> Generating 25%> Loading > buildSrc > Generating 26%> Loading > buildSrc
> Generating 27%> Loading > buildSrc > Generating 29%> Loading > buildSrc
> Generating 31%> Loading > buildSrc > Generating 36%> Loading > buildSrc
> Generating 38%> Loading > buildSrc > Generating 41%> Loading > buildSrc
> Generating 44%> Loading > buildSrc > Generating 45%> Loading > buildSrc
> Generating 47%> Loading > buildSrc > Generating 48%> Loading > buildSrc
> Generating 49%> Loading > buildSrc > Generating 50%> Loading > buildSrc
> Generating 51%> Loading > buildSrc > Generating 52%> Loading > buildSrc
> Generating 54%> Loading > buildSrc > Generating 56%> Loading > buildSrc
> Generating 58%> Loading > buildSrc > Generating 59%> Loading > buildSrc
> Generating 62%> Loading > buildSrc > Generating 63%> Loading > buildSrc
> Generating 64%> Loading > buildSrc > Generating 67%> Loading > buildSrc
> Generating 69%> Loading > buildSrc > Generating 70%> Loading > buildSrc
> Generating 73%> Loading > buildSrc > Generating 76%> Loading > buildSrc
> Generating 77%> Loading > buildSrc > Generating 78%> Loading > buildSrc
> Generating 80%> Loading > buildSrc > Generating 84%> Loading > buildSrc
> Generating 85%> Loading > buildSrc > Generating 86%> Loading > buildSrc
> Generating 87%> Loading > buildSrc > Generating 88%> Loading > buildSrc
> Generating 89%> Loading > buildSrc > Generating 92%> Loading > buildSrc
> Generating 93%> Loading > buildSrc > Generating 94%> Loading > buildSrc
> Generating 97%> Loading > buildSrc > Generating 100%                       
                
> Loading > buildSrc> Loading > buildSrc > Compiling /scratch/buildSrc/build.gradle
into local build cache > Compiling build file '/scratch/buildSrc/build.gradle' to cross
build script cache> Loading > buildSrc > Compiling /scratch/buildSrc/build.gradle
into local build cache> Loading > buildSrc> Loading > buildSrc > Resolving
dependencies ':runtime'> Loading > buildSrc> Loading > buildSrc > :buildSrc:clean:buildSrc:clean
UP-TO-DATE
:buildSrc:compileJava UP-TO-DATE
> Loading > buildSrc > :buildSrc:compileGroovy:buildSrc:compileGroovy
> Loading > buildSrc:buildSrc:processResources UP-TO-DATE
:buildSrc:classes
> Loading > buildSrc > :buildSrc:jar:buildSrc:jar
:buildSrc:assemble
:buildSrc:compileTestJava UP-TO-DATE
:buildSrc:compileTestGroovy UP-TO-DATE
:buildSrc:processTestResources UP-TO-DATE
:buildSrc:testClasses UP-TO-DATE
:buildSrc:test UP-TO-DATE
:buildSrc:check UP-TO-DATE
:buildSrc:build
> Loading > buildSrc> Loading > settings> Configuring > 0/5 projects >
root project > Compiling /scratch/build.gradle into local build cache > Compiling build
file '/scratch/build.gradle' to cross build script cache> Configuring > 0/5 projects
> root project > Compiling /scratch/build.gradle into local build cache> Configuring
> 0/5 projects > root project> Configuring > 0/5 projects
FAILURE: Build failed with an exception.

* Where:
Build file '/scratch/build.gradle' line: 18

* What went wrong:
Error resolving plugin [id: 'com.eriwen.gradle.js', version: '1.12.1']
> The response from https://plugins.gradle.org/api/gradle/3.1/plugin/use/com.eriwen.gradle.js/1.12.1
was not a valid response from a Gradle Plugin Resolution Service: content type is '', expected
'application/json' (status code: 500)

* Try:
Run with --stacktrace option to get the stack trace. Run with --info or --debug option to
get more log output.

BUILD FAILED

Total time: 1 mins 22.744 secs
debian/rules:30: recipe for target '__gradle_build' failed
make[1]: *** [__gradle_build] Error 1
make[1]: Leaving directory '/scratch'
debian/rules:20: recipe for target 'build' failed
make: *** [build] Error 2
dpkg-buildpackage: error: debian/rules build gave error exit status 2
Build step 'Execute shell' marked build as failure
Skipped archiving because build is not successful

Mime
View raw message