aurora-dev mailing list archives

Site index · List index
Message view « Date » · « Thread »
Top « Date » · « Thread »
From Apache Jenkins Server <jenk...@builds.apache.org>
Subject Build failed in Jenkins: aurora-packaging-nightly #510
Date Sat, 10 Dec 2016 00:39:04 GMT
See <https://builds.apache.org/job/aurora-packaging-nightly/510/changes>

Changes:

[jcohen] Fixup prepare_binary.sh to work under modern bash.

------------------------------------------
[...truncated 18947 lines...]
stdout

artifacts/aurora-centos-7/dist/rpmbuild/BUILD/apache-aurora-0.17.0-SNAPSHOT/src/test/resources/org/apache/thermos/root/logs/ordering/echo_three:
0

artifacts/aurora-centos-7/dist/rpmbuild/BUILD/apache-aurora-0.17.0-SNAPSHOT/src/test/resources/org/apache/thermos/root/logs/ordering/echo_three/0:
stdout

artifacts/aurora-centos-7/dist/rpmbuild/BUILD/apache-aurora-0.17.0-SNAPSHOT/src/test/resources/org/apache/thermos/root/logs/ordering/echo_two:
0

artifacts/aurora-centos-7/dist/rpmbuild/BUILD/apache-aurora-0.17.0-SNAPSHOT/src/test/resources/org/apache/thermos/root/logs/ordering/echo_two/0:
stdout

artifacts/aurora-centos-7/dist/rpmbuild/BUILD/apache-aurora-0.17.0-SNAPSHOT/src/test/resources/org/apache/thermos/root/logs/ports:
echo

artifacts/aurora-centos-7/dist/rpmbuild/BUILD/apache-aurora-0.17.0-SNAPSHOT/src/test/resources/org/apache/thermos/root/logs/ports/echo:
0

artifacts/aurora-centos-7/dist/rpmbuild/BUILD/apache-aurora-0.17.0-SNAPSHOT/src/test/resources/org/apache/thermos/root/logs/ports/echo/0:
stdout

artifacts/aurora-centos-7/dist/rpmbuild/BUILD/apache-aurora-0.17.0-SNAPSHOT/src/test/resources/org/apache/thermos/root/sandbox:
p1
p2
p3

artifacts/aurora-centos-7/dist/rpmbuild/BUILD/apache-aurora-0.17.0-SNAPSHOT/src/test/resources/org/apache/thermos/root/tasks:
active
finished

artifacts/aurora-centos-7/dist/rpmbuild/BUILD/apache-aurora-0.17.0-SNAPSHOT/src/test/resources/org/apache/thermos/root/tasks/active:
sleep60-lost

artifacts/aurora-centos-7/dist/rpmbuild/BUILD/apache-aurora-0.17.0-SNAPSHOT/src/test/resources/org/apache/thermos/root/tasks/finished:
failure
failure_limit
hello_world
ordering
ports
sleep60

artifacts/aurora-centos-7/dist/rpmbuild/BUILD/apache-aurora-0.17.0-SNAPSHOT/src/test/sh:
org

artifacts/aurora-centos-7/dist/rpmbuild/BUILD/apache-aurora-0.17.0-SNAPSHOT/src/test/sh/org:
apache

artifacts/aurora-centos-7/dist/rpmbuild/BUILD/apache-aurora-0.17.0-SNAPSHOT/src/test/sh/org/apache:
aurora

artifacts/aurora-centos-7/dist/rpmbuild/BUILD/apache-aurora-0.17.0-SNAPSHOT/src/test/sh/org/apache/aurora:
e2e

artifacts/aurora-centos-7/dist/rpmbuild/BUILD/apache-aurora-0.17.0-SNAPSHOT/src/test/sh/org/apache/aurora/e2e:
Dockerfile.netcat
Dockerfile.python
ephemeral_daemon_with_final.aurora
http
http_example.py
run-server.sh
test_bypass_leader_redirect_end_to_end.sh
test_daemonizing_process.aurora
test_end_to_end.sh
test_kerberos_end_to_end.sh
validate_serverset.py

artifacts/aurora-centos-7/dist/rpmbuild/BUILD/apache-aurora-0.17.0-SNAPSHOT/src/test/sh/org/apache/aurora/e2e/http:
http_example.aurora
http_example_bad_healthcheck.aurora
http_example_updated.aurora

artifacts/aurora-centos-7/dist/rpmbuild/BUILDROOT:

artifacts/aurora-centos-7/dist/rpmbuild/RPMS:
x86_64

artifacts/aurora-centos-7/dist/rpmbuild/RPMS/x86_64:
aurora-executor-0.17.0_SNAPSHOT.2016.11.11-1.el7.centos.aurora.x86_64.rpm
aurora-executor-0.17.0_SNAPSHOT.2016.11.16-1.el7.centos.aurora.x86_64.rpm
aurora-executor-0.17.0_SNAPSHOT.2016.12.09-1.el7.centos.aurora.x86_64.rpm
aurora-executor-0.17.0_SNAPSHOT.2016.12.10-1.el7.centos.aurora.x86_64.rpm
aurora-scheduler-0.17.0_SNAPSHOT.2016.11.11-1.el7.centos.aurora.x86_64.rpm
aurora-scheduler-0.17.0_SNAPSHOT.2016.11.16-1.el7.centos.aurora.x86_64.rpm
aurora-scheduler-0.17.0_SNAPSHOT.2016.12.09-1.el7.centos.aurora.x86_64.rpm
aurora-scheduler-0.17.0_SNAPSHOT.2016.12.10-1.el7.centos.aurora.x86_64.rpm
aurora-scheduler-debuginfo-0.17.0_SNAPSHOT.2016.11.11-1.el7.centos.aurora.x86_64.rpm
aurora-scheduler-debuginfo-0.17.0_SNAPSHOT.2016.11.16-1.el7.centos.aurora.x86_64.rpm
aurora-scheduler-debuginfo-0.17.0_SNAPSHOT.2016.12.09-1.el7.centos.aurora.x86_64.rpm
aurora-scheduler-debuginfo-0.17.0_SNAPSHOT.2016.12.10-1.el7.centos.aurora.x86_64.rpm
aurora-tools-0.17.0_SNAPSHOT.2016.11.11-1.el7.centos.aurora.x86_64.rpm
aurora-tools-0.17.0_SNAPSHOT.2016.11.16-1.el7.centos.aurora.x86_64.rpm
aurora-tools-0.17.0_SNAPSHOT.2016.12.09-1.el7.centos.aurora.x86_64.rpm
aurora-tools-0.17.0_SNAPSHOT.2016.12.10-1.el7.centos.aurora.x86_64.rpm
repodata

artifacts/aurora-centos-7/dist/rpmbuild/RPMS/x86_64/repodata:
0f5a9aab3180c29d45972d008c3d38799ce0103a3cdf7f66e5ed5ca77dc6fef6-filelists.xml.gz
1b14960833a2894a120ed773c59fafcffdde22675a3fb155c6c5460032e3e585-primary.sqlite.bz2
1c40f650a8bc33e0decff5dc99dba6e519d0801e58dd203424bfbeba2285bf16-other.sqlite.bz2
1da1fbd2dcfb526ceea2fb9e63c424bf552abe9d721aa0e93a2727e82b57072c-filelists.sqlite.bz2
2459dddab986b8e258a5c043d5e982f5ced93c1f44d11c5e1edaf7fa34cd9214-other.xml.gz
2dfb6538122a534fa2ce6e42107685fee9f1cf4ce746185faf0f5377a2b3d10c-primary.sqlite.bz2
3824053a5c960743ae213b39b38847ecd069060da1d842e018f9505924706aa9-primary.xml.gz
53a71fed06230ed0ac8d9acff868de62d741710433d8d2c2cade3f492588fe80-primary.sqlite.bz2
560044ea2d6fca2a58872327d1c97812a7e3426c38153a953a95e28ddbdaf982-primary.xml.gz
644b0240e664f47421a9f9fab7d1ba92ad82f3c17cc625dcb66c8f121bda37ae-filelists.xml.gz
6e7e1e91f58725f50ddb99d3a7ae3aa1e62ec61c81896c809d9186741955868f-other.sqlite.bz2
75b8b21881acc208ec8301fd8028c6aa9bce643ab9b00a7444953f64af3698cc-other.sqlite.bz2
7be936d2f86e8282eec413b88864f8a4ee3100edd8b2fd6f0016722a22c33a57-filelists.xml.gz
81f0105c99df5f414cf8d83d418c2c6eac417cae430122a8e53fd6b22f2b3ef4-other.xml.gz
8b78b419c934180ae345fa24c26c3f22ffb3fda783d45f8d54373c1e81140b9b-primary.xml.gz
90582e76155b0cc710d6e0ff3b4214ef53a74069cb263697d25c4caadcf53446-filelists.xml.gz
990362f6375704e7b2dae0d5699357f9c7e22d95cefa5783527e1e8435391cef-other.xml.gz
9b170f22c88d953c95b5fcf4d75eccfa8cbbcb76ca589067ab9ff6ad788481d9-other.xml.gz
aaefcf16ededd0bd1315ffbea02fcca3ca597eecfeaf6c2cd0d3f7e4768fb6ba-filelists.sqlite.bz2
af24ad0d1cc6dfaffa5c0c8037a4d91559285b60bdfb8729dbfa299fe17758e9-primary.sqlite.bz2
b80aeda2f2c633e4dfdbf230cbd73fb0c71306774b35cc3f157be8b0806dfc40-filelists.sqlite.bz2
c52241181567e33007f58d1b2488bd61cee8134fbf37ed3db179334977c5c571-primary.xml.gz
caa50e7e27f683c5b3e686400817cef24a68870a790a9288c6826a07a5451055-filelists.sqlite.bz2
e4933d7fd9e8dfcd481a3a2ca274f0dbd072fc0cce846f5e2a18cf98aefc9c3c-other.sqlite.bz2
repomd.xml

artifacts/aurora-centos-7/dist/rpmbuild/SOURCES:
apache-aurora-0.17.0_SNAPSHOT.2016.11.11.tar.gz
apache-aurora-0.17.0_SNAPSHOT.2016.11.16.tar.gz
apache-aurora-0.17.0_SNAPSHOT.2016.12.09.tar.gz
apache-aurora-0.17.0_SNAPSHOT.2016.12.10.tar.gz
aurora-pants.ini
aurora-scheduler.init.sh
aurora-scheduler.logrotate
aurora-scheduler.service
aurora-scheduler.startup.sh
aurora-scheduler.sysconfig
clusters.json
thermos.init.sh
thermos.logrotate
thermos.service
thermos.startup.sh
thermos.sysconfig

artifacts/aurora-centos-7/dist/rpmbuild/SRPMS:
aurora-scheduler-0.17.0_SNAPSHOT.2016.11.11-1.el7.centos.aurora.src.rpm
aurora-scheduler-0.17.0_SNAPSHOT.2016.11.16-1.el7.centos.aurora.src.rpm
aurora-scheduler-0.17.0_SNAPSHOT.2016.12.09-1.el7.centos.aurora.src.rpm
aurora-scheduler-0.17.0_SNAPSHOT.2016.12.10-1.el7.centos.aurora.src.rpm
builder/rpm/centos-7
Using docker image aurora-ubuntu-trusty
Sending build context to Docker daemon  5.12 kB

Step 1 : FROM ubuntu:trusty
 ---> 4d44acee901c
Step 2 : WORKDIR /aurora
 ---> Using cache
 ---> 557cc5655380
Step 3 : ENV HOME /aurora
 ---> Using cache
 ---> 1a9cbb986346
Step 4 : ENV DEBIAN_FRONTEND noninteractive
 ---> Using cache
 ---> 1eb0004c27dc
Step 5 : RUN apt-get update && apt-get -y install   bison   debhelper   devscripts
  dpkg-dev   curl   git   libapr1-dev   libcurl4-openssl-dev   libffi-dev   libsvn-dev   python-all-dev
  software-properties-common
 ---> Using cache
 ---> 5bbd9834c78c
Step 6 : RUN add-apt-repository -y ppa:openjdk-r/ppa   && apt-get update   &&
apt-get -y install openjdk-8-jdk   && update-alternatives --set java /usr/lib/jvm/java-8-openjdk-amd64/jre/bin/java
 ---> Using cache
 ---> 21e80f1fa477
Step 7 : RUN curl -sSL http://apache.org/dist/thrift/KEYS | gpg --import - &&    gpg
--export --armor 66B778F9 | sudo apt-key add - &&    echo 'deb http://www.apache.org/dist/thrift/debian
0.9.1 main' > /etc/apt/sources.list.d/thrift.list &&    apt-get update &&
   apt-get -y install thrift-compiler=0.9.1
 ---> Using cache
 ---> 51e1f3e7b5f7
Step 8 : RUN git clone --depth 1 https://github.com/benley/gradle-packaging   && cd
gradle-packaging   && apt-get -y install ruby ruby-dev unzip wget   && gem
install fpm && ./gradle-mkdeb.sh 3.1   && apt-get -y install gdebi-core  
&& gdebi --non-interactive gradle-3.1_3.1-2_all.deb   && cd .. &&
rm -rf gradle-packaging
 ---> Using cache
 ---> d88faa8f23a9
Step 9 : ADD build.sh /build.sh
 ---> Using cache
 ---> fd239dcc916f
Successfully built fd239dcc916f
+ mkdir /scratch
+ cd /scratch
+ tar --strip-components 1 -C . -xf /src.tar.gz
+ cp -R /specs/debian .
+ export 'DEBFULLNAME=Apache Aurora'
+ DEBFULLNAME='Apache Aurora'
+ export DEBEMAIL=dev@aurora.apache.org
+ DEBEMAIL=dev@aurora.apache.org
++ date -R
+ dch --newversion 0.17.0-SNAPSHOT.2016.12.10 --package apache-aurora --urgency medium 'Apache
Aurora package builder <dev@aurora.apache.org> Sat, 10 Dec 2016 00:12:54 +0000'
dch warning: Previous package version was Debian native whilst new version is not
+ dch --release ''
+ dpkg-buildpackage -uc -b -tc
dpkg-buildpackage: source package apache-aurora
dpkg-buildpackage: source version 0.17.0-SNAPSHOT.2016.12.10
dpkg-buildpackage: source distribution trusty
dpkg-buildpackage: source changed by Apache Aurora <dev@aurora.apache.org>
dpkg-buildpackage: host architecture amd64
 dpkg-source --before-build scratch
 debian/rules clean
dh clean --exclude=aurora-scheduler.bat
   dh_testdir -O--exclude=aurora-scheduler.bat
   dh_auto_clean -O--exclude=aurora-scheduler.bat
   dh_clean -O--exclude=aurora-scheduler.bat
 debian/rules build
dh build --exclude=aurora-scheduler.bat
   dh_testdir -O--exclude=aurora-scheduler.bat
   dh_auto_configure -O--exclude=aurora-scheduler.bat
   debian/rules override_dh_auto_build
make[1]: Entering directory `/scratch'
/usr/bin/gradle installDist
Starting a Gradle Daemon (subsequent builds will be faster)
> Starting Daemon> Starting Daemon > Connecting to Daemon> LoadingInvalidating
buildSrc state cache (/scratch/buildSrc/.gradle/noVersion/buildSrc) as it was not closed cleanly.
> Loading > buildSrc > settings> Loading > buildSrc> Loading > buildSrc
> Compiling jar:file:/opt/gradle-3.1/lib/gradle-core-3.1.jar!/org/gradle/initialization/buildsrc/defaultBuildSourceScript.txt
into local build cache> Loading > buildSrc > Compiling jar:file:/opt/gradle-3.1/lib/gradle-core-3.1.jar!/org/gradle/initialization/buildsrc/defaultBuildSourceScript.txt
into local build cache > Compiling script 'jar:file:/opt/gradle-3.1/lib/gradle-core-3.1.jar!/org/gradle/initialization/buildsrc/defaultBuildSourceScript.txt'
to cross build script cache> Loading > buildSrcGenerating JAR file 'gradle-api-3.1.jar'
> Loading > buildSrc> Loading > buildSrc > Generating 0%> Loading > buildSrc
> Generating 1%> Loading > buildSrc > Generating 2%> Loading > buildSrc
> Generating 3%> Loading > buildSrc > Generating 4%> Loading > buildSrc
> Generating 9%> Loading > buildSrc > Generating 20%> Loading > buildSrc
> Generating 25%> Loading > buildSrc > Generating 26%> Loading > buildSrc
> Generating 27%> Loading > buildSrc > Generating 29%> Loading > buildSrc
> Generating 36%> Loading > buildSrc > Generating 40%> Loading > buildSrc
> Generating 44%> Loading > buildSrc > Generating 47%> Loading > buildSrc
> Generating 49%> Loading > buildSrc > Generating 51%> Loading > buildSrc
> Generating 52%> Loading > buildSrc > Generating 56%> Loading > buildSrc
> Generating 58%> Loading > buildSrc > Generating 62%> Loading > buildSrc
> Generating 63%> Loading > buildSrc > Generating 64%> Loading > buildSrc
> Generating 67%> Loading > buildSrc > Generating 69%> Loading > buildSrc
> Generating 70%> Loading > buildSrc > Generating 75%> Loading > buildSrc
> Generating 76%> Loading > buildSrc > Generating 77%> Loading > buildSrc
> Generating 79%> Loading > buildSrc > Generating 84%> Loading > buildSrc
> Generating 85%> Loading > buildSrc > Generating 87%> Loading > buildSrc
> Generating 88%> Loading > buildSrc > Generating 89%> Loading > buildSrc
> Generating 92%> Loading > buildSrc > Generating 94%> Loading > buildSrc
> Generating 96%> Loading > buildSrc > Generating 100%                       
                
> Loading > buildSrc> Loading > buildSrc > Compiling /scratch/buildSrc/build.gradle
into local build cache> Loading > buildSrc > Compiling /scratch/buildSrc/build.gradle
into local build cache > Compiling build file '/scratch/buildSrc/build.gradle' to cross
build script cache> Loading > buildSrc > Compiling /scratch/buildSrc/build.gradle
into local build cache> Loading > buildSrc > Resolving dependencies ':runtime'>
Loading > buildSrc:buildSrc:clean UP-TO-DATE
:buildSrc:compileJava UP-TO-DATE
> Loading > buildSrc > :buildSrc:compileGroovy:buildSrc:compileGroovy
> Loading > buildSrc:buildSrc:processResources UP-TO-DATE
:buildSrc:classes
> Loading > buildSrc > :buildSrc:jar:buildSrc:jar
:buildSrc:assemble
:buildSrc:compileTestJava UP-TO-DATE
:buildSrc:compileTestGroovy UP-TO-DATE
:buildSrc:processTestResources UP-TO-DATE
:buildSrc:testClasses UP-TO-DATE
:buildSrc:test UP-TO-DATE
:buildSrc:check UP-TO-DATE
:buildSrc:build
> Loading > buildSrc> Loading> Loading > settings> Configuring > 0/5
projects > root project > Compiling /scratch/build.gradle into local build cache >
Compiling build file '/scratch/build.gradle' to cross build script cache> Configuring >
0/5 projects > root project > Compiling /scratch/build.gradle into local build cache>
Configuring > 0/5 projects > root project
FAILURE: Build failed with an exception.

* Where:
Build file '/scratch/build.gradle' line: 18

* What went wrong:
Error resolving plugin [id: 'com.eriwen.gradle.js', version: '1.12.1']
> org.apache.http.ssl.SSLInitializationException: /usr/lib/jvm/java-8-openjdk-amd64/jre/lib/security/cacerts
(No such file or directory)

* Try:
Run with --stacktrace option to get the stack trace. Run with --info or --debug option to
get more log output.

BUILD FAILED

Total time: 18.968 secs
make[1]: *** [__gradle_build] Error 1
make[1]: Leaving directory `/scratch'
make: *** [build] Error 2
dpkg-buildpackage: error: debian/rules build gave error exit status 2
Build step 'Execute shell' marked build as failure
Skipped archiving because build is not successful

Mime
View raw message