aurora-dev mailing list archives

Site index · List index
Message view « Date » · « Thread »
Top « Date » · « Thread »
From Zameer Manji <zma...@apache.org>
Subject Re: Build failed in Jenkins: Aurora #1665
Date Fri, 04 Nov 2016 23:39:14 GMT
Fixing the regression in https://reviews.apache.org/r/53508/

On Fri, Nov 4, 2016 at 4:14 PM, Zameer Manji <zmanji@apache.org> wrote:

> Looking
>
> On Fri, Nov 4, 2016 at 4:02 PM, Apache Jenkins Server <
> jenkins@builds.apache.org> wrote:
>
>> See <https://builds.apache.org/job/Aurora/1665/changes>
>>
>> Changes:
>>
>> [zmanji] Send SIGTERM to daemonized processes on shutdown.
>>
>> ------------------------------------------
>> [...truncated 2972 lines...]
>>                      collecting 122 items [0m [1m
>>                      collecting 122 items [0m [1m
>>                      collecting 134 items [0m [1m
>>                      collecting 137 items [0m [1m
>>                      collecting 137 items [0m [1m
>>                      collecting 139 items [0m [1m
>>                      collecting 143 items [0m [1m
>>                      collecting 143 items [0m [1m
>>                      collecting 151 items [0m [1m
>>                      collecting 152 items [0m [1m
>>                      collecting 166 items [0m [1m
>>                      collecting 174 items [0m [1m
>>                      collecting 175 items [0m [1m
>>                      collecting 176 items [0m [1m
>>                      collecting 184 items [0m [1m
>>                      collecting 188 items [0m [1m
>>                      collecting 192 items [0m [1m
>>                      collecting 199 items [0m [1m
>>                      collecting 206 items [0m [1m
>>                      collecting 206 items [0m [1m
>>                      collecting 208 items [0m [1m
>>                      collecting 210 items [0m [1m
>>                      collecting 210 items [0m [1m
>>                      collecting 211 items [0m [1m
>>                      collecting 212 items [0m [1m
>>                      collecting 215 items [0m [1m
>>                      collecting 215 items [0m [1m
>>                      collecting 215 items [0m [1m
>>                      collecting 232 items [0m [1m
>>                      collecting 232 items [0m [1m
>>                      collecting 234 items [0m [1m
>>                      collecting 234 items [0m [1m
>>                      collecting 234 items [0m [1m
>>                      collecting 249 items [0m [1m
>>                      collecting 250 items [0m [1m
>>                      collecting 256 items [0m [1m
>>                      collecting 256 items [0m [1m
>>                      collecting 256 items [0m [1m
>>                      collecting 259 items [0m [1m
>>                      collecting 259 items [0m [1m
>>                      collecting 260 items [0m [1m
>>                      collecting 261 items [0m [1m
>>                      collecting 263 items [0m [1m
>>                      collecting 264 items [0m [1m
>>                      collecting 273 items [0m [1m
>>                      collecting 276 items [0m [1m
>>                      collecting 287 items [0m [1m
>>                      collecting 291 items [0m [1m
>>                      collecting 291 items [0m [1m
>>                      collecting 291 items [0m [1m
>>                      collecting 301 items [0m [1m
>>                      collecting 301 items [0m [1m
>>                      collecting 301 items [0m [1m
>>                      collecting 301 items [0m [1m
>>                      collecting 301 items [0m [1m
>>                      collecting 303 items [0m [1m
>>                      collecting 304 items [0m [1m
>>                      collecting 305 items [0m [1m
>>                      collecting 306 items [0m [1m
>>                      collecting 309 items [0m [1m
>>                      collecting 309 items [0m [1m
>>                      collecting 309 items [0m [1m
>>                      collecting 314 items [0m [1m
>>                      collecting 314 items [0m [1m
>>                      collecting 314 items [0m [1m
>>                      collecting 317 items [0m [1m
>>                      collecting 317 items [0m [1m
>>                      collecting 317 items [0m [1m
>>                      collecting 317 items [0m [1m
>>                      collecting 325 items [0m [1m
>>                      collecting 326 items [0m [1m
>>                      collecting 326 items [0m [1m
>>                      collecting 326 items [0m [1m
>>                      collecting 331 items [0m [1m
>>                      collecting 331 items [0m [1m
>>                      collecting 331 items [0m [1m
>>                      collecting 332 items [0m [1m
>>                      collecting 332 items [0m [1m
>>                      collecting 332 items [0m [1m
>>                      collecting 334 items [0m [1m
>>                      collecting 336 items [0m [1m
>>                      collecting 339 items [0m [1m
>>                      collecting 339 items [0m [1m
>>                      collecting 339 items [0m [1m
>>                      collecting 344 items [0m [1m
>>                      collecting 344 items [0m [1m
>>                      collecting 344 items [0m [1m
>>                      collecting 356 items [0m [1m
>>                      collecting 360 items [0m [1m
>>                      collecting 361 items [0m [1m
>>                      collecting 363 items [0m [1m
>>                      collecting 366 items [0m [1m
>>                      collecting 368 items [0m [1m
>>                      collecting 371 items [0m [1m
>>                      collecting 376 items [0m [1m
>>                      collecting 382 items [0m [1m
>>                      collecting 382 items [0m [1m
>>                      collecting 382 items [0m [1m
>>                      collecting 384 items [0m [1m
>>                      collecting 392 items [0m [1m
>>                      collecting 392 items [0m [1m
>>                      collecting 392 items [0m [1m
>>                      collecting 405 items [0m [1m
>>                      collecting 405 items [0m [1m
>>                      collecting 405 items [0m [1m
>>                      collecting 409 items [0m [1m
>>                      collecting 409 items [0m [1m
>>                      collecting 409 items [0m [1m
>>                      collecting 411 items [0m [1m
>>                      collecting 411 items [0m [1m
>>                      collecting 411 items [0m [1m
>>                      collecting 421 items [0m [1m
>>                      collecting 421 items [0m [1m
>>                      collecting 421 items [0m [1m
>>                      collecting 423 items [0m [1m
>>                      collecting 423 items [0m [1m
>>                      collecting 423 items [0m [1m
>>                      collecting 429 items [0m [1m
>>                      collecting 429 items [0m [1m
>>                      collecting 432 items [0m [1m
>>                      collecting 436 items [0m [1m
>>                      collecting 436 items [0m [1m
>>                      collecting 436 items [0m [1m
>>                      collecting 436 items [0m [1m
>>                      collecting 436 items [0m [1m
>>                      collecting 436 items [0m [1m
>>                      collecting 437 items [0m [1m
>>                      collecting 450 items [0m [1m
>>                      collecting 450 items [0m [1m
>>                      collecting 450 items [0m [1m
>>                      collecting 452 items [0m [1m
>>                      collecting 459 items [0m [1m
>>                      collecting 460 items [0m [1m
>>                      collecting 471 items [0m [1m
>>                      collecting 471 items [0m [1m
>>                      collecting 471 items [0m [1m
>>                      collecting 474 items [0m [1m
>>                      collecting 474 items [0m [1m
>>                      collecting 474 items [0m [1m
>>                      collecting 476 items [0m [1m
>>                      collecting 476 items [0m [1m
>>                      collecting 476 items [0m [1m
>>                      collecting 481 items [0m [1m
>>                      collecting 481 items [0m [1m
>>                      collecting 481 items [0m [1m
>>                      collecting 491 items [0m [1m
>>                      collecting 491 items [0m [1m
>>                      collecting 491 items [0m [1m
>>                      collecting 499 items [0m [1m
>>                      collecting 499 items [0m [1m
>>                      collecting 499 items [0m [1m
>>                      collecting 501 items [0m [1m
>>                      collecting 519 items [0m [1m
>>                      collecting 519 items [0m [1m
>>                      collecting 520 items [0m [1m
>>                      collecting 521 items [0m [1m
>>                      collecting 521 items [0m [1m
>>                      collecting 521 items [0m [1m
>>                      collecting 524 items [0m [1m
>>                      collecting 527 items [0m [1m
>>                      collecting 534 items [0m [1m
>>                      collecting 534 items [0m [1m
>>                      collecting 540 items [0m [1m
>>                      collecting 540 items [0m [1m
>>                      collecting 550 items [0m [1m
>>                      collecting 550 items [0m [1m
>>                      collecting 550 items [0m [1m
>>                      collecting 551 items [0m [1m
>>                      collecting 551 items [0m [1m
>>                      collecting 551 items [0m [1m
>>                      collecting 557 items [0m [1m
>>                      collecting 557 items [0m [1m
>>                      collecting 563 items [0m [1m
>>                      collecting 563 items [0m [1m
>>                      collecting 584 items [0m [1m
>>                      collecting 622 items [0m [1m
>>                      collecting 633 items [0m [1m
>>                      collecting 636 items [0m [1m
>>                      collecting 674 items [0m [1m
>>                      collecting 674 items [0m [1m
>>                      collecting 677 items [0m [1m
>>                      collecting 677 items [0m [1m
>>                      collecting 680 items [0m [1m
>>                      collecting 680 items [0m [1m
>>                      collecting 686 items [0m [1m
>>                      collecting 697 items [0m [1m
>>                      collecting 700 items [0m [1m
>>                      collecting 703 items [0m [1m
>>                      collecting 704 items [0m [1m
>>                      collecting 705 items [0m [1m
>>                      collecting 718 items [0m [1m
>>                      collecting 721 items [0m [1m
>>                      collecting 726 items [0m [1m
>>                      collected 726 items
>>                       [0m
>>                      src/test/python/apache/thermo
>> s/core/test_helper.py::test_this_is_really_our_pid_root  [32mPASSED [0m
>>                      src/test/python/apache/thermo
>> s/core/test_helper.py::test_this_is_really_our_pid  [32mPASSED [0m
>>                      src/test/python/apache/thermo
>> s/core/test_helper.py::test_scan_process  [32mPASSED [0m
>>                      src/test/python/apache/thermo
>> s/core/test_process.py::test_simple_process  [32mPASSED [0m
>>                      src/test/python/apache/thermo
>> s/core/test_process.py::test_simple_process_filesystem_isolator
>> [32mPASSED [0m
>>                      src/test/python/apache/thermo
>> s/core/test_process.py::test_simple_process_other_user  [32mPASSED [0m
>>                      src/test/python/apache/thermo
>> s/core/test_process.py::test_other_user_fails_nonroot  [32mPASSED [0m
>>                      src/test/python/apache/thermo
>> s/core/test_process.py::test_log_permissions  [32mPASSED [0m
>>                      src/test/python/apache/thermo
>> s/core/test_process.py::test_log_permissions_other_user  [32mPASSED [0m
>>                      src/test/python/apache/thermo
>> s/core/test_process.py::test_cloexec  [32mPASSED [0m
>>                      src/test/python/apache/thermo
>> s/core/test_process.py::test_log_standard  [32mPASSED [0m
>>                      src/test/python/apache/thermo
>> s/core/test_process.py::test_log_rotation  [32mPASSED [0m
>>                      src/test/python/apache/thermo
>> s/core/test_process.py::test_preserve_env  [32mPASSED [0m
>>                      src/test/python/apache/thermo
>> s/core/test_process.py::test_tee_class  [32mPASSED [0m
>>                      src/test/python/apache/thermo
>> s/core/test_process.py::test_resolver_none_output  [32mPASSED [0m
>>                      src/test/python/apache/thermo
>> s/core/test_process.py::test_resolver_console_output  [32mPASSED [0m
>>                      src/test/python/apache/thermo
>> s/core/test_process.py::test_resolver_file_output  [32mPASSED [0m
>>                      src/test/python/apache/thermo
>> s/core/test_process.py::test_resolver_both_output  [32mPASSED [0m
>>                      src/test/python/apache/thermo
>> s/core/test_process.py::test_resolver_both_with_rotation_output
>> [32mPASSED [0m
>>                      src/test/python/apache/thermo
>> s/core/test_process.py::test_log_none  [32mPASSED [0m
>>                      src/test/python/apache/thermo
>> s/core/test_process.py::test_log_console  [32mPASSED [0m
>>                      src/test/python/apache/thermo
>> s/core/test_process.py::test_log_tee  [32mPASSED [0m
>>                      src/test/python/apache/thermo
>> s/core/test_runner_integration.py <- .pants.d/python-setup/chroots/
>> aa8c19ee98132b1d807c9921997c09adcdd43a98/apache/thermos/test
>> ing/runner.py::TestRunnerBasic::test_runner_state_reconstruction
>> [32mPASSED [0m
>>                      src/test/python/apache/thermo
>> s/core/test_runner_integration.py::TestRunnerBasic::test_runner_state_success
>> [31mFAILED [0m
>>                      src/test/python/apache/thermo
>> s/core/test_runner_integration.py::TestRunnerBasic::test_runner_header_populated
>> [32mPASSED [0m
>>                      src/test/python/apache/thermo
>> s/core/test_runner_integration.py::TestRunnerBasic::test_
>> runner_has_allocated_name_ports  [32mPASSED [0m
>>                      src/test/python/apache/thermo
>> s/core/test_runner_integration.py::TestRunnerBasic::test_runner_has_expected_processes
>> [31mFAILED [0m
>>                      src/test/python/apache/thermo
>> s/core/test_runner_integration.py::TestRunnerBasic::test_
>> runner_processes_have_expected_output  [31mFAILED [0m
>>                      src/test/python/apache/thermo
>> s/core/test_runner_integration.py::TestRunnerBasic::test_
>> runner_processes_have_monotonically_increasing_timestamps  [31mFAILED [0m
>>                      src/test/python/apache/thermo
>> s/core/test_runner_integration.py <- .pants.d/python-setup/chroots/
>> aa8c19ee98132b1d807c9921997c09adcdd43a98/apache/thermos/test
>> ing/runner.py::TestConcurrencyBasic::test_runner_state_reconstruction
>> [32mPASSED [0m
>>                      src/test/python/apache/thermo
>> s/core/test_runner_integration.py::TestConcurrencyBasic::test_runner_state_success
>> [31mFAILED [0m
>>                      src/test/python/apache/thermo
>> s/core/test_runner_integration.py::TestConcurrencyBasic::
>> test_runner_processes_separated_temporally_due_to_concurrency_limit
>> [31mFAILED [0m
>>                      src/test/python/apache/thermo
>> s/core/test_runner_integration.py <- .pants.d/python-setup/chroots/
>> aa8c19ee98132b1d807c9921997c09adcdd43a98/apache/thermos/test
>> ing/runner.py::TestRunnerEnvironment::test_runner_state_reconstruction
>> [32mPASSED [0m
>>                      src/test/python/apache/thermo
>> s/core/test_runner_integration.py::TestRunnerEnvironment::test_runner_state_success
>> [31mFAILED [0m
>>                      src/test/python/apache/thermo
>> s/core/test_runner_integration.py::TestRunnerEnvironment::
>> test_runner_processes_have_expected_output  [31mFAILED [0m
>>                      src/test/python/apache/thermo
>> s/core/test_runner_log_config.py <- .pants.d/python-setup/chroots/
>> aa8c19ee98132b1d807c9921997c09adcdd43a98/apache/thermos/test
>> ing/runner.py::TestStandardStdout::test_runner_state_reconstruction
>> [32mPASSED [0m
>>                      src/test/python/apache/thermo
>> s/core/test_runner_log_config.py::TestStandardStdout::test_log_config
>> [31mFAILED [0m
>>                      src/test/python/apache/thermo
>> s/core/test_runner_log_config.py <- .pants.d/python-setup/chroots/
>> aa8c19ee98132b1d807c9921997c09adcdd43a98/apache/thermos/test
>> ing/runner.py::TestStandardStderr::test_runner_state_reconstruction
>> [32mPASSED [0m
>>                      src/test/python/apache/thermo
>> s/core/test_runner_log_config.py::TestStandardStderr::test_log_config
>> [31mFAILED [0m
>>                      src/test/python/apache/thermo
>> s/core/test_runner_log_config.py <- .pants.d/python-setup/chroots/
>> aa8c19ee98132b1d807c9921997c09adcdd43a98/apache/thermos/test
>> ing/runner.py::TestRotateUnderStdout::test_runner_state_reconstruction
>> [32mPASSED [0m
>>                      src/test/python/apache/thermo
>> s/core/test_runner_log_config.py::TestRotateUnderStdout::test_log_config
>> [31mFAILED [0m
>>                      src/test/python/apache/thermo
>> s/core/test_runner_log_config.py <- .pants.d/python-setup/chroots/
>> aa8c19ee98132b1d807c9921997c09adcdd43a98/apache/thermos/test
>> ing/runner.py::TestRotateUnderStderr::test_runner_state_reconstruction
>> [32mPASSED [0m
>>                      src/test/python/apache/thermo
>> s/core/test_runner_log_config.py::TestRotateUnderStderr::test_log_config
>> [31mFAILED [0m
>>                      src/test/python/apache/thermo
>> s/core/test_runner_log_config.py <- .pants.d/python-setup/chroots/
>> aa8c19ee98132b1d807c9921997c09adcdd43a98/apache/thermos/test
>> ing/runner.py::TestRotateOverStdout::test_runner_state_reconstruction
>> [32mPASSED [0m
>>                      src/test/python/apache/thermo
>> s/core/test_runner_log_config.py::TestRotateOverStdout::test_log_config
>> [31mFAILED [0m
>>                      src/test/python/apache/thermo
>> s/core/test_runner_log_config.py <- .pants.d/python-setup/chroots/
>> aa8c19ee98132b1d807c9921997c09adcdd43a98/apache/thermos/test
>> ing/runner.py::TestRotateOverStderr::test_runner_state_reconstruction
>> [32mPASSED [0m
>>                      src/test/python/apache/thermo
>> s/core/test_runner_log_config.py::TestRotateOverStderr::test_log_config
>> [31mFAILED [0m
>>                      src/test/python/apache/thermo
>> s/core/test_runner_log_config.py <- .pants.d/python-setup/chroots/
>> aa8c19ee98132b1d807c9921997c09adcdd43a98/apache/thermos/test
>> ing/runner.py::TestRotateDefaulted::test_runner_state_reconstruction
>> [32mPASSED [0m
>>                      src/test/python/apache/thermo
>> s/core/test_runner_log_config.py::TestRotateDefaulted::test_log_config
>> [31mFAILED [0m
>>                      src/test/python/apache/thermo
>> s/core/test_staged_kill.py::TestRunnerKill::test_process_kill Build
>> timed out (after 120 minutes). Marking the build as failed.
>> Build was aborted
>> Recording test results
>> ERROR: Step ?Publish JUnit test result report? failed: No test report
>> files were found. Configuration error?
>>
>> --
>> Zameer Manji
>>
>


-- 
Zameer Manji

Mime
  • Unnamed multipart/alternative (inline, None, 0 bytes)
View raw message