aurora-dev mailing list archives

Site index · List index
Message view « Date » · « Thread »
Top « Date » · « Thread »
From Apache Jenkins Server <jenk...@builds.apache.org>
Subject Build failed in Jenkins: Aurora #1665
Date Fri, 04 Nov 2016 23:02:24 GMT
See <https://builds.apache.org/job/Aurora/1665/changes>

Changes:

[zmanji] Send SIGTERM to daemonized processes on shutdown.

------------------------------------------
[...truncated 2972 lines...]
                     collecting 122 items
                     collecting 122 items
                     collecting 134 items
                     collecting 137 items
                     collecting 137 items
                     collecting 139 items
                     collecting 143 items
                     collecting 143 items
                     collecting 151 items
                     collecting 152 items
                     collecting 166 items
                     collecting 174 items
                     collecting 175 items
                     collecting 176 items
                     collecting 184 items
                     collecting 188 items
                     collecting 192 items
                     collecting 199 items
                     collecting 206 items
                     collecting 206 items
                     collecting 208 items
                     collecting 210 items
                     collecting 210 items
                     collecting 211 items
                     collecting 212 items
                     collecting 215 items
                     collecting 215 items
                     collecting 215 items
                     collecting 232 items
                     collecting 232 items
                     collecting 234 items
                     collecting 234 items
                     collecting 234 items
                     collecting 249 items
                     collecting 250 items
                     collecting 256 items
                     collecting 256 items
                     collecting 256 items
                     collecting 259 items
                     collecting 259 items
                     collecting 260 items
                     collecting 261 items
                     collecting 263 items
                     collecting 264 items
                     collecting 273 items
                     collecting 276 items
                     collecting 287 items
                     collecting 291 items
                     collecting 291 items
                     collecting 291 items
                     collecting 301 items
                     collecting 301 items
                     collecting 301 items
                     collecting 301 items
                     collecting 301 items
                     collecting 303 items
                     collecting 304 items
                     collecting 305 items
                     collecting 306 items
                     collecting 309 items
                     collecting 309 items
                     collecting 309 items
                     collecting 314 items
                     collecting 314 items
                     collecting 314 items
                     collecting 317 items
                     collecting 317 items
                     collecting 317 items
                     collecting 317 items
                     collecting 325 items
                     collecting 326 items
                     collecting 326 items
                     collecting 326 items
                     collecting 331 items
                     collecting 331 items
                     collecting 331 items
                     collecting 332 items
                     collecting 332 items
                     collecting 332 items
                     collecting 334 items
                     collecting 336 items
                     collecting 339 items
                     collecting 339 items
                     collecting 339 items
                     collecting 344 items
                     collecting 344 items
                     collecting 344 items
                     collecting 356 items
                     collecting 360 items
                     collecting 361 items
                     collecting 363 items
                     collecting 366 items
                     collecting 368 items
                     collecting 371 items
                     collecting 376 items
                     collecting 382 items
                     collecting 382 items
                     collecting 382 items
                     collecting 384 items
                     collecting 392 items
                     collecting 392 items
                     collecting 392 items
                     collecting 405 items
                     collecting 405 items
                     collecting 405 items
                     collecting 409 items
                     collecting 409 items
                     collecting 409 items
                     collecting 411 items
                     collecting 411 items
                     collecting 411 items
                     collecting 421 items
                     collecting 421 items
                     collecting 421 items
                     collecting 423 items
                     collecting 423 items
                     collecting 423 items
                     collecting 429 items
                     collecting 429 items
                     collecting 432 items
                     collecting 436 items
                     collecting 436 items
                     collecting 436 items
                     collecting 436 items
                     collecting 436 items
                     collecting 436 items
                     collecting 437 items
                     collecting 450 items
                     collecting 450 items
                     collecting 450 items
                     collecting 452 items
                     collecting 459 items
                     collecting 460 items
                     collecting 471 items
                     collecting 471 items
                     collecting 471 items
                     collecting 474 items
                     collecting 474 items
                     collecting 474 items
                     collecting 476 items
                     collecting 476 items
                     collecting 476 items
                     collecting 481 items
                     collecting 481 items
                     collecting 481 items
                     collecting 491 items
                     collecting 491 items
                     collecting 491 items
                     collecting 499 items
                     collecting 499 items
                     collecting 499 items
                     collecting 501 items
                     collecting 519 items
                     collecting 519 items
                     collecting 520 items
                     collecting 521 items
                     collecting 521 items
                     collecting 521 items
                     collecting 524 items
                     collecting 527 items
                     collecting 534 items
                     collecting 534 items
                     collecting 540 items
                     collecting 540 items
                     collecting 550 items
                     collecting 550 items
                     collecting 550 items
                     collecting 551 items
                     collecting 551 items
                     collecting 551 items
                     collecting 557 items
                     collecting 557 items
                     collecting 563 items
                     collecting 563 items
                     collecting 584 items
                     collecting 622 items
                     collecting 633 items
                     collecting 636 items
                     collecting 674 items
                     collecting 674 items
                     collecting 677 items
                     collecting 677 items
                     collecting 680 items
                     collecting 680 items
                     collecting 686 items
                     collecting 697 items
                     collecting 700 items
                     collecting 703 items
                     collecting 704 items
                     collecting 705 items
                     collecting 718 items
                     collecting 721 items
                     collecting 726 items
                     collected 726 items 
                     
                     src/test/python/apache/thermos/core/test_helper.py::test_this_is_really_our_pid_root
PASSED
                     src/test/python/apache/thermos/core/test_helper.py::test_this_is_really_our_pid
PASSED
                     src/test/python/apache/thermos/core/test_helper.py::test_scan_process
PASSED
                     src/test/python/apache/thermos/core/test_process.py::test_simple_process
PASSED
                     src/test/python/apache/thermos/core/test_process.py::test_simple_process_filesystem_isolator
PASSED
                     src/test/python/apache/thermos/core/test_process.py::test_simple_process_other_user
PASSED
                     src/test/python/apache/thermos/core/test_process.py::test_other_user_fails_nonroot
PASSED
                     src/test/python/apache/thermos/core/test_process.py::test_log_permissions
PASSED
                     src/test/python/apache/thermos/core/test_process.py::test_log_permissions_other_user
PASSED
                     src/test/python/apache/thermos/core/test_process.py::test_cloexec PASSED
                     src/test/python/apache/thermos/core/test_process.py::test_log_standard
PASSED
                     src/test/python/apache/thermos/core/test_process.py::test_log_rotation
PASSED
                     src/test/python/apache/thermos/core/test_process.py::test_preserve_env
PASSED
                     src/test/python/apache/thermos/core/test_process.py::test_tee_class PASSED
                     src/test/python/apache/thermos/core/test_process.py::test_resolver_none_output
PASSED
                     src/test/python/apache/thermos/core/test_process.py::test_resolver_console_output
PASSED
                     src/test/python/apache/thermos/core/test_process.py::test_resolver_file_output
PASSED
                     src/test/python/apache/thermos/core/test_process.py::test_resolver_both_output
PASSED
                     src/test/python/apache/thermos/core/test_process.py::test_resolver_both_with_rotation_output
PASSED
                     src/test/python/apache/thermos/core/test_process.py::test_log_none PASSED
                     src/test/python/apache/thermos/core/test_process.py::test_log_console
PASSED
                     src/test/python/apache/thermos/core/test_process.py::test_log_tee PASSED
                     src/test/python/apache/thermos/core/test_runner_integration.py <-
.pants.d/python-setup/chroots/aa8c19ee98132b1d807c9921997c09adcdd43a98/apache/thermos/testing/runner.py::TestRunnerBasic::test_runner_state_reconstruction
PASSED
                     src/test/python/apache/thermos/core/test_runner_integration.py::TestRunnerBasic::test_runner_state_success
FAILED
                     src/test/python/apache/thermos/core/test_runner_integration.py::TestRunnerBasic::test_runner_header_populated
PASSED
                     src/test/python/apache/thermos/core/test_runner_integration.py::TestRunnerBasic::test_runner_has_allocated_name_ports
PASSED
                     src/test/python/apache/thermos/core/test_runner_integration.py::TestRunnerBasic::test_runner_has_expected_processes
FAILED
                     src/test/python/apache/thermos/core/test_runner_integration.py::TestRunnerBasic::test_runner_processes_have_expected_output
FAILED
                     src/test/python/apache/thermos/core/test_runner_integration.py::TestRunnerBasic::test_runner_processes_have_monotonically_increasing_timestamps
FAILED
                     src/test/python/apache/thermos/core/test_runner_integration.py <-
.pants.d/python-setup/chroots/aa8c19ee98132b1d807c9921997c09adcdd43a98/apache/thermos/testing/runner.py::TestConcurrencyBasic::test_runner_state_reconstruction
PASSED
                     src/test/python/apache/thermos/core/test_runner_integration.py::TestConcurrencyBasic::test_runner_state_success
FAILED
                     src/test/python/apache/thermos/core/test_runner_integration.py::TestConcurrencyBasic::test_runner_processes_separated_temporally_due_to_concurrency_limit
FAILED
                     src/test/python/apache/thermos/core/test_runner_integration.py <-
.pants.d/python-setup/chroots/aa8c19ee98132b1d807c9921997c09adcdd43a98/apache/thermos/testing/runner.py::TestRunnerEnvironment::test_runner_state_reconstruction
PASSED
                     src/test/python/apache/thermos/core/test_runner_integration.py::TestRunnerEnvironment::test_runner_state_success
FAILED
                     src/test/python/apache/thermos/core/test_runner_integration.py::TestRunnerEnvironment::test_runner_processes_have_expected_output
FAILED
                     src/test/python/apache/thermos/core/test_runner_log_config.py <- .pants.d/python-setup/chroots/aa8c19ee98132b1d807c9921997c09adcdd43a98/apache/thermos/testing/runner.py::TestStandardStdout::test_runner_state_reconstruction
PASSED
                     src/test/python/apache/thermos/core/test_runner_log_config.py::TestStandardStdout::test_log_config
FAILED
                     src/test/python/apache/thermos/core/test_runner_log_config.py <- .pants.d/python-setup/chroots/aa8c19ee98132b1d807c9921997c09adcdd43a98/apache/thermos/testing/runner.py::TestStandardStderr::test_runner_state_reconstruction
PASSED
                     src/test/python/apache/thermos/core/test_runner_log_config.py::TestStandardStderr::test_log_config
FAILED
                     src/test/python/apache/thermos/core/test_runner_log_config.py <- .pants.d/python-setup/chroots/aa8c19ee98132b1d807c9921997c09adcdd43a98/apache/thermos/testing/runner.py::TestRotateUnderStdout::test_runner_state_reconstruction
PASSED
                     src/test/python/apache/thermos/core/test_runner_log_config.py::TestRotateUnderStdout::test_log_config
FAILED
                     src/test/python/apache/thermos/core/test_runner_log_config.py <- .pants.d/python-setup/chroots/aa8c19ee98132b1d807c9921997c09adcdd43a98/apache/thermos/testing/runner.py::TestRotateUnderStderr::test_runner_state_reconstruction
PASSED
                     src/test/python/apache/thermos/core/test_runner_log_config.py::TestRotateUnderStderr::test_log_config
FAILED
                     src/test/python/apache/thermos/core/test_runner_log_config.py <- .pants.d/python-setup/chroots/aa8c19ee98132b1d807c9921997c09adcdd43a98/apache/thermos/testing/runner.py::TestRotateOverStdout::test_runner_state_reconstruction
PASSED
                     src/test/python/apache/thermos/core/test_runner_log_config.py::TestRotateOverStdout::test_log_config
FAILED
                     src/test/python/apache/thermos/core/test_runner_log_config.py <- .pants.d/python-setup/chroots/aa8c19ee98132b1d807c9921997c09adcdd43a98/apache/thermos/testing/runner.py::TestRotateOverStderr::test_runner_state_reconstruction
PASSED
                     src/test/python/apache/thermos/core/test_runner_log_config.py::TestRotateOverStderr::test_log_config
FAILED
                     src/test/python/apache/thermos/core/test_runner_log_config.py <- .pants.d/python-setup/chroots/aa8c19ee98132b1d807c9921997c09adcdd43a98/apache/thermos/testing/runner.py::TestRotateDefaulted::test_runner_state_reconstruction
PASSED
                     src/test/python/apache/thermos/core/test_runner_log_config.py::TestRotateDefaulted::test_log_config
FAILED
                     src/test/python/apache/thermos/core/test_staged_kill.py::TestRunnerKill::test_process_kill
Build timed out (after 120 minutes). Marking the build as failed.
Build was aborted
Recording test results
ERROR: Step ?Publish JUnit test result report? failed: No test report files were found. Configuration
error?


Mime
View raw message