aurora-dev mailing list archives

Site index · List index
Message view « Date » · « Thread »
Top « Date » · « Thread »
From Apache Jenkins Server <jenk...@builds.apache.org>
Subject Build failed in Jenkins: Aurora #1641
Date Tue, 11 Oct 2016 00:15:13 GMT
See <https://builds.apache.org/job/Aurora/1641/changes>

Changes:

[john.sirois] Upgrade to pants 1.2.0rc0.

------------------------------------------
[...truncated 3343 lines...]
                     collecting 100 items
                     collecting 102 items
                     collecting 110 items
                     collecting 110 items
                     collecting 111 items
                     collecting 116 items
                     collecting 117 items
                     collecting 120 items
                     collecting 122 items
                     collecting 122 items
                     collecting 122 items
                     collecting 125 items
                     collecting 125 items
                     collecting 137 items
                     collecting 139 items
                     collecting 143 items
                     collecting 143 items
                     collecting 157 items
                     collecting 158 items
                     collecting 166 items
                     collecting 174 items
                     collecting 175 items
                     collecting 176 items
                     collecting 184 items
                     collecting 188 items
                     collecting 192 items
                     collecting 199 items
                     collecting 206 items
                     collecting 206 items
                     collecting 208 items
                     collecting 210 items
                     collecting 210 items
                     collecting 212 items
                     collecting 212 items
                     collecting 212 items
                     collecting 213 items
                     collecting 216 items
                     collecting 216 items
                     collecting 216 items
                     collecting 232 items
                     collecting 247 items
                     collecting 248 items
                     collecting 248 items
                     collecting 249 items
                     collecting 252 items
                     collecting 252 items
                     collecting 252 items
                     collecting 258 items
                     collecting 258 items
                     collecting 259 items
                     collecting 260 items
                     collecting 262 items
                     collecting 263 items
                     collecting 272 items
                     collecting 275 items
                     collecting 286 items
                     collecting 290 items
                     collecting 290 items
                     collecting 290 items
                     collecting 300 items
                     collecting 300 items
                     collecting 300 items
                     collecting 305 items
                     collecting 305 items
                     collecting 307 items
                     collecting 308 items
                     collecting 309 items
                     collecting 310 items
                     collecting 313 items
                     collecting 313 items
                     collecting 313 items
                     collecting 313 items
                     collecting 313 items
                     collecting 313 items
                     collecting 313 items
                     collecting 321 items
                     collecting 324 items
                     collecting 324 items
                     collecting 324 items
                     collecting 325 items
                     collecting 325 items
                     collecting 325 items
                     collecting 330 items
                     collecting 330 items
                     collecting 330 items
                     collecting 331 items
                     collecting 331 items
                     collecting 331 items
                     collecting 333 items
                     collecting 335 items
                     collecting 338 items
                     collecting 338 items
                     collecting 338 items
                     collecting 343 items
                     collecting 343 items
                     collecting 343 items
                     collecting 355 items
                     collecting 359 items
                     collecting 360 items
                     collecting 362 items
                     collecting 365 items
                     collecting 367 items
                     collecting 370 items
                     collecting 375 items
                     collecting 381 items
                     collecting 381 items
                     collecting 381 items
                     collecting 383 items
                     collecting 391 items
                     collecting 391 items
                     collecting 391 items
                     collecting 404 items
                     collecting 404 items
                     collecting 404 items
                     collecting 408 items
                     collecting 408 items
                     collecting 408 items
                     collecting 410 items
                     collecting 410 items
                     collecting 410 items
                     collecting 420 items
                     collecting 420 items
                     collecting 420 items
                     collecting 422 items
                     collecting 422 items
                     collecting 422 items
                     collecting 428 items
                     collecting 428 items
                     collecting 431 items
                     collecting 435 items
                     collecting 435 items
                     collecting 435 items
                     collecting 435 items
                     collecting 435 items
                     collecting 435 items
                     collecting 436 items
                     collecting 449 items
                     collecting 449 items
                     collecting 449 items
                     collecting 451 items
                     collecting 458 items
                     collecting 459 items
                     collecting 470 items
                     collecting 470 items
                     collecting 470 items
                     collecting 473 items
                     collecting 473 items
                     collecting 473 items
                     collecting 475 items
                     collecting 475 items
                     collecting 475 items
                     collecting 480 items
                     collecting 480 items
                     collecting 480 items
                     collecting 490 items
                     collecting 490 items
                     collecting 490 items
                     collecting 491 items
                     collecting 491 items
                     collecting 491 items
                     collecting 493 items
                     collecting 509 items
                     collecting 509 items
                     collecting 510 items
                     collecting 518 items
                     collecting 518 items
                     collecting 518 items
                     collecting 521 items
                     collecting 524 items
                     collecting 531 items
                     collecting 531 items
                     collecting 537 items
                     collecting 537 items
                     collecting 540 items
                     collecting 540 items
                     collecting 540 items
                     collecting 541 items
                     collecting 541 items
                     collecting 541 items
                     collecting 547 items
                     collecting 547 items
                     collecting 553 items
                     collecting 553 items
                     collecting 574 items
                     collecting 612 items
                     collecting 623 items
                     collecting 626 items
                     collecting 664 items
                     collecting 664 items
                     collecting 674 items
                     collecting 674 items
                     collecting 677 items
                     collecting 677 items
                     collecting 683 items
                     collecting 694 items
                     collecting 697 items
                     collecting 700 items
                     collecting 701 items
                     collecting 702 items
                     collecting 715 items
                     collecting 718 items
                     collecting 723 items
                     collected 723 items 
                     
                     src/test/python/apache/thermos/core/test_helper.py::test_this_is_really_our_pid_root
PASSED
                     src/test/python/apache/thermos/core/test_helper.py::test_this_is_really_our_pid
PASSED
                     src/test/python/apache/thermos/core/test_helper.py::test_scan_process
PASSED
                     src/test/python/apache/thermos/core/test_process.py::test_simple_process
PASSED
                     src/test/python/apache/thermos/core/test_process.py::test_simple_process_filesystem_isolator
PASSED
                     src/test/python/apache/thermos/core/test_process.py::test_simple_process_other_user
PASSED
                     src/test/python/apache/thermos/core/test_process.py::test_other_user_fails_nonroot
PASSED
                     src/test/python/apache/thermos/core/test_process.py::test_log_permissions
PASSED
                     src/test/python/apache/thermos/core/test_process.py::test_log_permissions_other_user
PASSED
                     src/test/python/apache/thermos/core/test_process.py::test_cloexec PASSED
                     src/test/python/apache/thermos/core/test_process.py::test_log_standard
PASSED
                     src/test/python/apache/thermos/core/test_process.py::test_log_rotation
PASSED
                     src/test/python/apache/thermos/core/test_process.py::test_preserve_env
PASSED
                     src/test/python/apache/thermos/core/test_process.py::test_tee_class PASSED
                     src/test/python/apache/thermos/core/test_process.py::test_resolver_none_output
PASSED
                     src/test/python/apache/thermos/core/test_process.py::test_resolver_console_output
PASSED
                     src/test/python/apache/thermos/core/test_process.py::test_resolver_file_output
PASSED
                     src/test/python/apache/thermos/core/test_process.py::test_resolver_both_output
PASSED
                     src/test/python/apache/thermos/core/test_process.py::test_resolver_both_with_rotation_output
PASSED
                     src/test/python/apache/thermos/core/test_process.py::test_log_none PASSED
                     src/test/python/apache/thermos/core/test_process.py::test_log_console
PASSED
                     src/test/python/apache/thermos/core/test_process.py::test_log_tee PASSED
                     src/test/python/apache/thermos/core/test_runner_integration.py <-
.pants.d/python-setup/chroots/8c4d043b3b7aac440e9c73ce8bd7c93a62eef12f/apache/thermos/testing/runner.py::TestRunnerBasic::test_runner_state_reconstruction
PASSED
                     src/test/python/apache/thermos/core/test_runner_integration.py::TestRunnerBasic::test_runner_state_success
PASSED
                     src/test/python/apache/thermos/core/test_runner_integration.py::TestRunnerBasic::test_runner_header_populated
PASSED
                     src/test/python/apache/thermos/core/test_runner_integration.py::TestRunnerBasic::test_runner_has_allocated_name_ports
PASSED
                     src/test/python/apache/thermos/core/test_runner_integration.py::TestRunnerBasic::test_runner_has_expected_processes
PASSED
                     src/test/python/apache/thermos/core/test_runner_integration.py::TestRunnerBasic::test_runner_processes_have_expected_output
PASSED
                     src/test/python/apache/thermos/core/test_runner_integration.py::TestRunnerBasic::test_runner_processes_have_monotonically_increasing_timestamps
PASSED
                     src/test/python/apache/thermos/core/test_runner_integration.py <-
.pants.d/python-setup/chroots/8c4d043b3b7aac440e9c73ce8bd7c93a62eef12f/apache/thermos/testing/runner.py::TestConcurrencyBasic::test_runner_state_reconstruction
PASSED
                     src/test/python/apache/thermos/core/test_runner_integration.py::TestConcurrencyBasic::test_runner_state_success
PASSED
                     src/test/python/apache/thermos/core/test_runner_integration.py::TestConcurrencyBasic::test_runner_processes_separated_temporally_due_to_concurrency_limit
PASSED
                     src/test/python/apache/thermos/core/test_runner_integration.py <-
.pants.d/python-setup/chroots/8c4d043b3b7aac440e9c73ce8bd7c93a62eef12f/apache/thermos/testing/runner.py::TestRunnerEnvironment::test_runner_state_reconstruction
PASSED
                     src/test/python/apache/thermos/core/test_runner_integration.py::TestRunnerEnvironment::test_runner_state_success
PASSED
                     src/test/python/apache/thermos/core/test_runner_integration.py::TestRunnerEnvironment::test_runner_processes_have_expected_output
PASSED
                     src/test/python/apache/thermos/core/test_runner_log_config.py <- .pants.d/python-setup/chroots/8c4d043b3b7aac440e9c73ce8bd7c93a62eef12f/apache/thermos/testing/runner.py::TestStandardStdout::test_runner_state_reconstruction
FAILED
                     INTERNALERROR> Traceback (most recent call last):
                     INTERNALERROR>   File "/home/jenk
FAILURE


00:14:46 00:40   [complete]
               FAILURE
Build step 'Execute shell' marked build as failure
Recording test results

Mime
View raw message