aurora-dev mailing list archives

Site index · List index
Message view « Date » · « Thread »
Top « Date » · « Thread »
From Apache Jenkins Server <jenk...@builds.apache.org>
Subject Build failed in Jenkins: aurora-packaging-nightly #408
Date Mon, 29 Aug 2016 00:34:24 GMT
See <https://builds.apache.org/job/aurora-packaging-nightly/408/>

------------------------------------------
[...truncated 1404 lines...]
    77% |########################        | 1.2MB 31.0MB/s eta 0:00:01
    77% |########################        | 1.3MB 30.9MB/s eta 0:00:01
    78% |#########################       | 1.3MB 30.1MB/s eta 0:00:01
    79% |#########################       | 1.3MB 30.8MB/s eta 0:00:01
    79% |#########################       | 1.3MB 32.4MB/s eta 0:00:01
    80% |#########################       | 1.3MB 31.5MB/s eta 0:00:01
    80% |#########################       | 1.3MB 32.2MB/s eta 0:00:01
    81% |##########################      | 1.3MB 32.7MB/s eta 0:00:01
    82% |##########################      | 1.3MB 32.9MB/s eta 0:00:01
    82% |##########################      | 1.3MB 33.3MB/s eta 0:00:01
    83% |##########################      | 1.4MB 32.8MB/s eta 0:00:01
    84% |##########################      | 1.4MB 33.3MB/s eta 0:00:01
    84% |###########################     | 1.4MB 33.2MB/s eta 0:00:01
    85% |###########################     | 1.4MB 31.9MB/s eta 0:00:01
    86% |###########################     | 1.4MB 32.9MB/s eta 0:00:01
    86% |###########################     | 1.4MB 32.8MB/s eta 0:00:01
    87% |###########################     | 1.4MB 32.8MB/s eta 0:00:01
    87% |############################    | 1.4MB 32.6MB/s eta 0:00:01
    88% |############################    | 1.4MB 31.6MB/s eta 0:00:01
    89% |############################    | 1.4MB 32.6MB/s eta 0:00:01
    89% |############################    | 1.5MB 32.5MB/s eta 0:00:01
    90% |############################    | 1.5MB 32.1MB/s eta 0:00:01
    91% |#############################   | 1.5MB 32.8MB/s eta 0:00:01
    91% |#############################   | 1.5MB 33.2MB/s eta 0:00:01
    92% |#############################   | 1.5MB 22.4MB/s eta 0:00:01
    93% |#############################   | 1.5MB 22.3MB/s eta 0:00:01
    93% |#############################   | 1.5MB 21.9MB/s eta 0:00:01
    94% |##############################  | 1.5MB 22.4MB/s eta 0:00:01
    94% |##############################  | 1.5MB 22.4MB/s eta 0:00:01
    95% |##############################  | 1.5MB 22.0MB/s eta 0:00:01
    96% |##############################  | 1.6MB 22.5MB/s eta 0:00:01
    96% |##############################  | 1.6MB 22.5MB/s eta 0:00:01
    97% |############################### | 1.6MB 22.6MB/s eta 0:00:01
    98% |############################### | 1.6MB 22.6MB/s eta 0:00:01
    98% |############################### | 1.6MB 32.8MB/s eta 0:00:01
    99% |############################### | 1.6MB 33.9MB/s eta 0:00:01
    99% |############################### | 1.6MB 33.9MB/s eta 0:00:01
    100% |################################| 1.6MB 485kB/s 
Collecting twitter.common.confluence<0.4,>=0.3.1 (from pantsbuild.pants==1.1.0-rc7)
  Downloading twitter.common.confluence-0.3.7.tar.gz
Collecting fasteners==0.14.1 (from pantsbuild.pants==1.1.0-rc7)
  Downloading fasteners-0.14.1-py2.py3-none-any.whl
Collecting coverage<3.8,>=3.7 (from pantsbuild.pants==1.1.0-rc7)
  Downloading coverage-3.7.1.tar.gz (284kB)

    3% |#                               | 10kB 35.8MB/s eta 0:00:01
    7% |##                              | 20kB 36.6MB/s eta 0:00:01
    10% |###                             | 30kB 40.9MB/s eta 0:00:01
    14% |####                            | 40kB 41.8MB/s eta 0:00:01
    17% |#####                           | 51kB 42.7MB/s eta 0:00:01
    21% |######                          | 61kB 45.1MB/s eta 0:00:01
    25% |########                        | 71kB 45.9MB/s eta 0:00:01
    28% |#########                       | 81kB 47.7MB/s eta 0:00:01
    32% |##########                      | 92kB 48.1MB/s eta 0:00:01
    35% |###########                     | 102kB 48.2MB/s eta 0:00:01
    39% |############                    | 112kB 51.4MB/s eta 0:00:01
    43% |#############                   | 122kB 53.2MB/s eta 0:00:01
    46% |##############                  | 133kB 52.9MB/s eta 0:00:01
    50% |################                | 143kB 55.0MB/s eta 0:00:01
    53% |#################               | 153kB 55.5MB/s eta 0:00:01
    57% |##################              | 163kB 55.7MB/s eta 0:00:01
    61% |###################             | 174kB 55.7MB/s eta 0:00:01
    64% |####################            | 184kB 53.9MB/s eta 0:00:01
    68% |#####################           | 194kB 55.1MB/s eta 0:00:01
    71% |#######################         | 204kB 54.8MB/s eta 0:00:01
    75% |########################        | 215kB 52.2MB/s eta 0:00:01
    79% |#########################       | 225kB 53.3MB/s eta 0:00:01
    82% |##########################      | 235kB 53.3MB/s eta 0:00:01
    86% |###########################     | 245kB 53.0MB/s eta 0:00:01
    89% |############################    | 256kB 52.9MB/s eta 0:00:01
    93% |#############################   | 266kB 51.6MB/s eta 0:00:01
    97% |############################### | 276kB 52.8MB/s eta 0:00:01
    100% |################################| 286kB 3.2MB/s 
Collecting pytest<2.7,>=2.6 (from pantsbuild.pants==1.1.0-rc7)
  Downloading pytest-2.6.4.tar.gz (512kB)

    1% |                                | 10kB 40.5MB/s eta 0:00:01
    3% |#                               | 20kB 39.9MB/s eta 0:00:01
    5% |#                               | 30kB 45.1MB/s eta 0:00:01
    7% |##                              | 40kB 45.6MB/s eta 0:00:01
    9% |###                             | 51kB 46.2MB/s eta 0:00:01
    11% |###                             | 61kB 47.7MB/s eta 0:00:01
    13% |####                            | 71kB 48.0MB/s eta 0:00:01
    15% |#####                           | 81kB 48.0MB/s eta 0:00:01
    17% |#####                           | 92kB 49.5MB/s eta 0:00:01
    19% |######                          | 102kB 49.4MB/s eta 0:00:01
    21% |#######                         | 112kB 51.8MB/s eta 0:00:01
    23% |#######                         | 122kB 52.4MB/s eta 0:00:01
    25% |########                        | 133kB 51.2MB/s eta 0:00:01
    27% |########                        | 143kB 52.4MB/s eta 0:00:01
    29% |#########                       | 153kB 52.3MB/s eta 0:00:01
    31% |##########                      | 163kB 51.4MB/s eta 0:00:01
    33% |##########                      | 174kB 50.2MB/s eta 0:00:01
    35% |###########                     | 184kB 49.8MB/s eta 0:00:01
    37% |############                    | 194kB 48.3MB/s eta 0:00:01
    39% |############                    | 204kB 47.2MB/s eta 0:00:01
    41% |#############                   | 215kB 45.6MB/s eta 0:00:01
    43% |##############                  | 225kB 45.8MB/s eta 0:00:01
    45% |##############                  | 235kB 45.3MB/s eta 0:00:01
    47% |###############                 | 245kB 44.3MB/s eta 0:00:01
    49% |###############                 | 256kB 44.9MB/s eta 0:00:01
    51% |################                | 266kB 44.5MB/s eta 0:00:01
    53% |#################               | 276kB 45.5MB/s eta 0:00:01
    55% |#################               | 286kB 45.7MB/s eta 0:00:01
    57% |##################              | 296kB 45.4MB/s eta 0:00:01
    59% |###################             | 307kB 47.0MB/s eta 0:00:01
    61% |###################             | 317kB 47.0MB/s eta 0:00:01
    63% |####################            | 327kB 47.1MB/s eta 0:00:01
    65% |#####################           | 337kB 48.3MB/s eta 0:00:01
    67% |#####################           | 348kB 48.2MB/s eta 0:00:01
    69% |######################          | 358kB 48.1MB/s eta 0:00:01
    71% |#######################         | 368kB 48.1MB/s eta 0:00:01
    73% |#######################         | 378kB 47.4MB/s eta 0:00:01
    75% |########################        | 389kB 47.7MB/s eta 0:00:01
    77% |########################        | 399kB 46.0MB/s eta 0:00:01
    79% |#########################       | 409kB 44.6MB/s eta 0:00:01
    81% |##########################      | 419kB 45.9MB/s eta 0:00:01
    83% |##########################      | 430kB 45.8MB/s eta 0:00:01
    85% |###########################     | 440kB 45.5MB/s eta 0:00:01
    87% |############################    | 450kB 45.5MB/s eta 0:00:01
    89% |############################    | 460kB 44.8MB/s eta 0:00:01
    91% |#############################   | 471kB 46.0MB/s eta 0:00:01
    93% |##############################  | 481kB 46.1MB/s eta 0:00:01
    95% |##############################  | 491kB 45.8MB/s eta 0:00:01
    97% |############################### | 501kB 49.0MB/s eta 0:00:01
    99% |############################### | 512kB 50.1MB/s eta 0:00:01
    100% |################################| 522kB 1.5MB/s 
Collecting pytest-cov<1.9,>=1.8 (from pantsbuild.pants==1.1.0-rc7)
  Downloading pytest-cov-1.8.1.tar.gz
Collecting lmdb==0.89 (from pantsbuild.pants==1.1.0-rc7)
  Downloading lmdb-0.89.tar.gz (149kB)

    6% |##                              | 10kB 38.8MB/s eta 0:00:01
    13% |####                            | 20kB 34.5MB/s eta 0:00:01
    20% |######                          | 30kB 36.9MB/s eta 0:00:01
    27% |########                        | 40kB 38.8MB/s eta 0:00:01
    34% |##########                      | 51kB 40.6MB/s eta 0:00:01
    41% |#############                   | 61kB 41.3MB/s eta 0:00:01
    47% |###############                 | 71kB 41.6MB/s eta 0:00:01
    54% |#################               | 81kB 41.9MB/s eta 0:00:01
    61% |###################             | 92kB 42.4MB/s eta 0:00:01
    68% |#####################           | 102kB 42.4MB/s eta 0:00:01
    75% |########################        | 112kB 43.4MB/s eta 0:00:01
    82% |##########################      | 122kB 46.4MB/s eta 0:00:01
    88% |############################    | 133kB 4.0MB/s eta 0:00:01
    95% |##############################  | 143kB 4.0MB/s eta 0:00:01
    100% |################################| 153kB 2.4MB/s 
Collecting twitter.common.lang==0.3.7 (from twitter.common.collections<0.4,>=0.3.1->pantsbuild.pants==1.1.0-rc7)
  Downloading twitter.common.lang-0.3.7.tar.gz
Collecting twitter.common.log==0.3.7 (from twitter.common.confluence<0.4,>=0.3.1->pantsbuild.pants==1.1.0-rc7)
  Downloading twitter.common.log-0.3.7.tar.gz
Collecting monotonic>=0.1 (from fasteners==0.14.1->pantsbuild.pants==1.1.0-rc7)
  Downloading monotonic-1.2-py2.py3-none-any.whl
Collecting py>=1.4.25 (from pytest<2.7,>=2.6->pantsbuild.pants==1.1.0-rc7)
  Downloading py-1.4.31-py2.py3-none-any.whl (81kB)

    12% |###                             | 10kB 31.8MB/s eta 0:00:01
    24% |#######                         | 20kB 32.9MB/s eta 0:00:01
    37% |###########                     | 30kB 35.2MB/s eta 0:00:01
    49% |###############                 | 40kB 36.8MB/s eta 0:00:01
    62% |###################             | 51kB 37.2MB/s eta 0:00:01
    74% |#######################         | 61kB 38.1MB/s eta 0:00:01
    87% |###########################     | 71kB 38.2MB/s eta 0:00:01
    99% |############################### | 81kB 39.5MB/s eta 0:00:01
    100% |################################| 92kB 8.0MB/s 
Collecting cov-core>=1.14.0 (from pytest-cov<1.9,>=1.8->pantsbuild.pants==1.1.0-rc7)
  Downloading cov-core-1.15.0.tar.gz
Collecting twitter.common.options==0.3.7 (from twitter.common.log==0.3.7->twitter.common.confluence<0.4,>=0.3.1->pantsbuild.pants==1.1.0-rc7)
  Downloading twitter.common.options-0.3.7.tar.gz
Building wheels for collected packages: pantsbuild.pants, ansicolors, setproctitle, twitter.common.collections,
pathspec, twitter.common.dirutil, pystache, scandir, psutil, pywatchman, Markdown, Pygments,
docutils, twitter.common.confluence, coverage, pytest, pytest-cov, lmdb, twitter.common.lang,
twitter.common.log, cov-core, twitter.common.options
  Running setup.py bdist_wheel for pantsbuild.pants ... - \ | / - \ | done
  Stored in directory: /aurora/.cache/pip/wheels/0e/8d/3c/5c472e7224c2ace87738d5b7cbb8bcfbcd1fe14c27330649c1
  Running setup.py bdist_wheel for ansicolors ... - done
  Stored in directory: /aurora/.cache/pip/wheels/3a/e9/7a/d539da1af316475bbfe0710f15249d194ccf96755293af318d
  Running setup.py bdist_wheel for setproctitle ... - \ | / - done
  Stored in directory: /aurora/.cache/pip/wheels/5b/e6/ac/0a9f3ba8962551d270aa651226c7ccb561b3c3f94063cb2f27
  Running setup.py bdist_wheel for twitter.common.collections ... - done
  Stored in directory: /aurora/.cache/pip/wheels/2a/6b/3e/7d9b44c1b4f01d0fb06719364b5c1e0de008daa63f6d5ca03d
  Running setup.py bdist_wheel for pathspec ... - \ done
  Stored in directory: /aurora/.cache/pip/wheels/05/fc/50/1a7e8fc57b03fe4c1299f1cf04e89ac8606614769ca65a9f5f
  Running setup.py bdist_wheel for twitter.common.dirutil ... - \ done
  Stored in directory: /aurora/.cache/pip/wheels/a0/dd/df/4fddf60e01e1f28877f441649de6d3b8b08f64f4b5ff09ceeb
  Running setup.py bdist_wheel for pystache ... - \ | done
  Stored in directory: /aurora/.cache/pip/wheels/9f/ad/66/0c671b563cdf76d88f1ab37a9db5e1804e2dd32cff0e70454e
  Running setup.py bdist_wheel for scandir ... - \ done
  Stored in directory: /aurora/.cache/pip/wheels/05/30/da/2e612ab84a6efb0d3fc104856ecda6dd21d49793679b9b4357
  Running setup.py bdist_wheel for psutil ... - \ | / done
  Stored in directory: /aurora/.cache/pip/wheels/e9/8b/35/535f07b31ebe94e56901cee48e1291e18989b272d79de437db
  Running setup.py bdist_wheel for pywatchman ... - \ | done
  Stored in directory: /aurora/.cache/pip/wheels/72/10/43/28655ed4bb6bd65cfee7d3e377b05c1218ba5ccfc52da4e1c4
  Running setup.py bdist_wheel for Markdown ... - \ | / done
  Stored in directory: /aurora/.cache/pip/wheels/54/57/5d/d85a28804ddffc92283587426652d63ed9578cc01fbf6be957
  Running setup.py bdist_wheel for Pygments ... - \ | done
  Stored in directory: /aurora/.cache/pip/wheels/ea/0e/59/c878cc73abc93eff6f42d83a924b5901f4163c3c9e1e1ffc1f
  Running setup.py bdist_wheel for docutils ... - \ | / - done
  Stored in directory: /aurora/.cache/pip/wheels/db/de/bd/b99b1e12d321fbc950766c58894c6576b1a73ae3131b29a151
  Running setup.py bdist_wheel for twitter.common.confluence ... - done
  Stored in directory: /aurora/.cache/pip/wheels/25/c3/50/6a11de424e46102442655de1b43333f20b1f81df131398d2a3
  Running setup.py bdist_wheel for coverage ... - \ | done
  Stored in directory: /aurora/.cache/pip/wheels/09/d5/14/fad8864342631171117f01b9b2473a07c053e5c1054d40e48c
  Running setup.py bdist_wheel for pytest ... - \ done
  Stored in directory: /aurora/.cache/pip/wheels/ca/1c/fe/8b76e537572f91c810910e822cccb178ba3156e432e644ac89
  Running setup.py bdist_wheel for pytest-cov ... - done
  Stored in directory: /aurora/.cache/pip/wheels/e5/94/08/eab43cda4e17e6ae729ed2cd832d7ca4e3ddca7fa6886ec2b8
  Running setup.py bdist_wheel for lmdb ... - \ | / - done
  Stored in directory: /aurora/.cache/pip/wheels/1d/36/58/b211fed809590977150eabf644580f7bc23569d1d782275fd6
  Running setup.py bdist_wheel for twitter.common.lang ... - done
  Stored in directory: /aurora/.cache/pip/wheels/b4/91/6b/e0a5ae9722528a67f600d436e0b97b30a040a65a5a35978272
  Running setup.py bdist_wheel for twitter.common.log ... - done
  Stored in directory: /aurora/.cache/pip/wheels/26/36/82/e6a6b7ca739262435cecee1cde7950bf60950f1aaa2ce21093
  Running setup.py bdist_wheel for cov-core ... - done
  Stored in directory: /aurora/.cache/pip/wheels/86/e1/c2/9ff8cfe9773ce07003f2c2be096e169af4614c2f634671d49b
  Running setup.py bdist_wheel for twitter.common.options ... - done
  Stored in directory: /aurora/.cache/pip/wheels/60/c2/40/54b323809df9598cc125f02527f93ff743cd9bd979f4a1737d
Successfully built pantsbuild.pants ansicolors setproctitle twitter.common.collections pathspec
twitter.common.dirutil pystache scandir psutil pywatchman Markdown Pygments docutils twitter.common.confluence
coverage pytest pytest-cov lmdb twitter.common.lang twitter.common.log cov-core twitter.common.options
Installing collected packages: ansicolors, setproctitle, twitter.common.lang, twitter.common.collections,
six, pathspec, twitter.common.dirutil, requests, pystache, scandir, psutil, pywatchman, futures,
setuptools, pex, Markdown, Pygments, docutils, twitter.common.options, twitter.common.log,
twitter.common.confluence, monotonic, fasteners, coverage, py, pytest, cov-core, pytest-cov,
lmdb, pantsbuild.pants
  Found existing installation: setuptools 21.2.1
    Uninstalling setuptools-21.2.1:
      Successfully uninstalled setuptools-21.2.1
Successfully installed Markdown-2.1.1 Pygments-1.4 ansicolors-1.0.2 cov-core-1.15.0 coverage-3.7.1
docutils-0.12 fasteners-0.14.1 futures-3.0.5 lmdb-0.89 monotonic-1.2 pantsbuild.pants-1.1.0rc7
pathspec-0.3.4 pex-1.1.10 psutil-4.3.0 py-1.4.31 pystache-0.5.3 pytest-2.6.4 pytest-cov-1.8.1
pywatchman-1.3.0 requests-2.5.3 scandir-1.2 setproctitle-1.1.10 setuptools-5.4.1 six-1.10.0
twitter.common.collections-0.3.7 twitter.common.confluence-0.3.7 twitter.common.dirutil-0.3.7
twitter.common.lang-0.3.7 twitter.common.log-0.3.7 twitter.common.options-0.3.7
fatal: Not a git repository (or any of the parent directories): .git

00:34:07 00:00 [main]
               (To run a reporting server: ./pants server)
00:34:07 00:00   [setup]
00:34:07 00:00     [parse]fatal: Not a git repository (or any of the parent directories):
.git

               Executing tasks in goals: binary
00:34:08 00:01   [binary]
00:34:08 00:01     [binary-prep-command]
00:34:08 00:01     [python-binary-create]
00:34:08 00:01       [cache] 
                   No cached artifacts for 1 target.
                   Invalidated 1 target.
00:34:13 00:06       [chroot]INFO] Attempting to fetch thrift binary from: https://dl.bintray.com/pantsbuild/bin/build-support/bin/thrift/linux/x86_64/0.9.1/thrift
...

FAILURE: Failed to fetch binary bin/thrift/linux/x86_64/0.9.1/thrift from any source: (Failed
to fetch binary from https://dl.bintray.com/pantsbuild/bin/build-support/bin/thrift/linux/x86_64/0.9.1/thrift:
Problem GETing data from https://dl.bintray.com/pantsbuild/bin/build-support/bin/thrift/linux/x86_64/0.9.1/thrift:
HTTPSConnectionPool(host='akamai.bintray.com', port=443): Read timed out. (read timeout=1.0))


00:34:14 00:07   [complete]
               FAILURE
debian/rules:33: recipe for target '__pants_build' failed
make[1]: *** [__pants_build] Error 1
make[1]: Leaving directory '/scratch'
debian/rules:20: recipe for target 'build' failed
make: *** [build] Error 2
dpkg-buildpackage: error: debian/rules build gave error exit status 2
Build step 'Execute shell' marked build as failure
Skipped archiving because build is not successful

Mime
View raw message